Peptide,PTM,ModifiedAA,ModifiedPosition,PeptideUniqueToGene,ExperimentDesc,ExpID,PubmedID,ScoreType,IdentScore,LocProb,Log2FChange,PQ-val,QuantSig,PEP,MassErrorPPM
HYSLSVGQSVFRPGR,ph,S,81,true,"atm and atr DNA damage response",88,25561503,"MASCOT Score",28.0000000,0.9000000,,,,,-1.2800000
HYSLSVGQSVFR,ph,S,81,true,"atm and atr DNA damage response",88,25561503,"MASCOT Score",24.0000000,0.9140000,,,,,-0.2900000
HYSLSVGQSVFR,ph,S,81,true,"Tissue atlas Arabidopsis - ProteomicsDB",114,32188942,"MaxQuant score",220.9600000,0.9999720,,,,0,
IEVQTEGMTPETGTYR,ph,T,288,false,"Tissue atlas Arabidopsis - ProteomicsDB",114,32188942,"MaxQuant score",306.2600000,0.9993430,,,,0,
IEVQTEGMTPETGTYR,ph,T,291,false,"Tissue atlas Arabidopsis - ProteomicsDB",114,32188942,"MaxQuant score",151.0400000,0.8422110,,,,6.9375399869287E-10,
FRCCLSQPMTID,acy,C,402,true,"Arabidopsis S-acylation atlas - Meristem",163a,35681017,,,,,,,,
FRCCLSQPMTID,acy,C,402,true,"Arabidopsis S-acylation atlas - Hypocotyl",163b,35681017,,,,,,,,
FRCCLSQPMTID,acy,C,402,true,"Arabidopsis S-acylation atlas - Leaf",163c,35681017,,,,,,,,
FRCCLSQPMTID,acy,C,402,true,"Arabidopsis S-acylation atlas - Silique",163e,35681017,,,,,,,,
CCLSQPMTID,acy,C,402,true,"Arabidopsis S-acylation atlas - Seedling",163d,35681017,,,,,,,,
CCLSQPMTID,acy,C,402,true,"Arabidopsis S-acylation atlas - Silique",163e,35681017,,,,,,,,
FRCCLSQPMTID,acy,C,403,true,"Arabidopsis S-acylation atlas - Meristem",163a,35681017,,,,,,,,
FRCCLSQPMTID,acy,C,403,true,"Arabidopsis S-acylation atlas - Hypocotyl",163b,35681017,,,,,,,,
FRCCLSQPMTID,acy,C,403,true,"Arabidopsis S-acylation atlas - Leaf",163c,35681017,,,,,,,,
FRCCLSQPMTID,acy,C,403,true,"Arabidopsis S-acylation atlas - Silique",163e,35681017,,,,,,,,
CCLSQPMTID,acy,C,403,true,"Arabidopsis S-acylation atlas - Seedling",163d,35681017,,,,,,,,
CCLSQPMTID,acy,C,403,true,"Arabidopsis S-acylation atlas - Silique",163e,35681017,,,,,,,,
