Peptide,PTM,ModifiedAA,ModifiedPosition,PeptideUniqueToGene,ExperimentDesc,ExpID,PubmedID,ScoreType,IdentScore,LocProb,Log2FChange,PQ-val,QuantSig,PEP,MassErrorPPM
AGTGLFAEILDGEVY,nt,A,2,true,"Arg/N-end rule seed, prt6 vs. Wt",99,29168982,"MASCOT Score",44.6200000,,,,,0.041880000382662,-3.0027026
AGTGLFAEILDGEVYK,nta,A,2,true,"Characterization plant N-terminal acetylation",6,22223895,"MASCOT Score",91.1900000,,,,,,
AGTGLFAEILDGEVY,nta,A,2,true,"Arg/N-end rule seed, prt6 vs. Wt",99,29168982,"MASCOT Score",44.6200000,,,,,0.041880000382662,-3.0027026
AGTGLFAEILDGEVYK,ph,T,4,true,"STN8 phosphoproteome",38,21768351,"MASCOT Score",54.4800000,,,,,,-5.6288500
AGTGLFAEILDGEVYK,ph,T,4,true,"Chloroplast kinase substrates",60,19376835,"MASCOT Score",50.5900000,,,,,,1.2538700
AGTGLFAEILDGEVYK,ph,T,4,true,"SIRK1 phosphorylation",86a,23820729,"MaxQuant Score",105.8200000,1.0000000,,,,0.44400000572205,0.7720000
AGTGLFAEILDGEVYK,ph,T,4,true,"SIRK1 exp - sirk1 mutant vs WT",86b,23820729,,,,0.5506687,,NO,,
AGTGLFAEILDGEVYK,ph,T,4,true,"SIRK1 exp - 35S:SIRK1 vs WT",86c,23820729,,,,-0.1499766,,NO,,
YYADGEWKTSSSGK,ac,K,25,true,"Quantitative Acetylproteomics",101,29440448,,,,,,,,
YYADGEWKTSSSGK,ub,K,25,true,"upl3 mutant / wildtype",168,35926874,"MaxQuant score",80.7460000,1.0000000,-0.5820800,0.5285400,NO,0.00020287200459279,-0.1343700
TSSSGKSVAIMNPATR,ac,K,31,true,"Quantitative Acetylproteomics",101,29440448,,,,,,,,
TSSSGKSVAIMNPATR,ub,K,31,true,"upl3 mutant / wildtype",168,35926874,"MaxQuant score",105.8900000,1.0000000,-0.9601597,0.2873000,NO,2.0828099422943E-7,0.3263500
SVAIMNPATRK,mox,M,36,true,"cat2 Methionine oxidation - 1h stress",62a,25693801,"MASCOT Score",71.0000000,,0.1721411,,NO,,
VQACTQEEVNAVMELAK,sno,C,50,true,"Site-specific nitrosomeproteomic id - gsnor1-3",90b,25699590,XCorr,2.6100000,,,,,3.4960001357831E-5,-7.6300000
VQACTQEEVNAVMELAK,sno,C,50,true,"hot5-4 / wildtype, FAT-switch S-nitrosoproteome",169,37277371,,,,,,,,
RAELLHKAAAILK,ub,K,83,true,"upl3 mutant / wildtype",168,35926874,"MaxQuant score",110.3800000,1.0000000,0.0565835,,,1.5500700101256E-5,0.5773300
APMAESLVK,mox,M,95,true,"cat2 Methionine oxidation - 1h stress",62a,25693801,"MASCOT Score",34.0000000,,0.0885773,,NO,,
APMAESLVK,mox,M,95,true,"cat2 Methionine oxidation - 3h stress",62b,25693801,"MASCOT Score",47.0000000,,-0.1159501,,NO,,
EIAKPAKDSVTEVVR,ub,K,108,true,"upl3 mutant / wildtype",168,35926874,"MaxQuant score",75.7640000,0.9590000,-0.7083964,0.1453370,NO,8.2209902757313E-5,0.4238500
SGDLISYCAEEGVR,nt,S,117,true,"N-terminal ChaFRADIC",92,26010716,"MASCOT Score",63.3600000,,,,,5.0869999768111E-8,
SGDLISYCAEEGVR,acy,C,124,true,"Arabidopsis S-acylation atlas - Meristem",163a,35681017,,,,,,,,
FLLSDSFPGNDR,ph,S,142,true,"Touch-induced phosphorylation: 40s touch vs untouc",136,30291188,"MASCOT score",71.4000000,,-0.2386391,0.6976121,NO,,1.6285615
SVADELVE,nt,S,309,true,"N-terminal ChaFRADIC",92,26010716,"MASCOT Score",76.1700000,,,,,0.070519998669624,
SVEEGINHC,nt,S,404,true,"N-terminal ChaFRADIC",92,26010716,"MASCOT Score",30.0200000,,,,,1.8870000531024E-6,
SVEEGINH,nt,S,404,true,"N-terminal ChaFRADIC",92,26010716,"MASCOT Score",28.6900000,,,,,8.4870000137016E-5,
VKTTVINLPTPSYSMG,ac,K,482,true,"Quantitative Acetylproteomics",101,29440448,,,,,,,,
TTVINLPTPSYSMG,ph,S,494,true,"atm and atr DNA damage response",88,25561503,"MASCOT Score",24.0000000,0.9910000,,,,,-0.0400000
TTVINLPTPSYSMG,mox,M,495,true,"cat2 Methionine oxidation - 1h stress",62a,25693801,"MASCOT Score",31.0000000,,-0.0591874,,NO,,
TTVINLPTPSYSMG,mox,M,495,true,"cat2 Methionine oxidation - 3h stress",62b,25693801,"MASCOT Score",34.0000000,,-0.1692018,,NO,,
