Peptide,PTM,ModifiedAA,ModifiedPosition,PeptideUniqueToGene,ExperimentDesc,ExpID,PubmedID,ScoreType,IdentScore,LocProb,Log2FChange,PQ-val,QuantSig,PEP,MassErrorPPM
MQQQGEPSVLSLRPGGGGGKSR,nta,M,1,true,"N-terminal ChaFRADIC",92,26010716,"MASCOT Score",38.3000000,,,,,7.3750002229644E-6,
MQQQGEPSVLSLRPGGGGGKSR,nta,M,1,true,"Arabidopsis translation initiation landscape - NTA",167a,35069635,,,,,,,,
MQQQGEPSVLSLRPGGGGGK,ph,S,8,true,"Tissue atlas Arabidopsis - ProteomicsDB",114,32188942,"MaxQuant score",115.5700000,0.9794980,,,,8.8386399978505E-13,
FSSSSSFDLTNGGSEETPFPVK,ph,S,29,true,"Large-scale phosphorylation discovery",44,23111157,XCorr,3.2380000,,,,,,
FSSSSSFDLTNGGSEETPFPVKR,ph,S,30,true,"Tissue atlas Arabidopsis - ProteomicsDB",114,32188942,"MaxQuant score",196.6500000,0.9939830,,,,0,
FSSSSSFDLTNGGSEETPFPVKR,ph,S,32,true,"Tissue atlas Arabidopsis - ProteomicsDB",114,32188942,"MaxQuant score",257.2200000,0.9190020,,,,0,
FSSSSSFDLTNGGSEETPFPVK,ph,S,32,true,"Large-scale phosphorylation discovery",44,23111157,XCorr,4.1860000,,,,,,
FSSSSSFDLTNGGSEETPFPVK,ph,S,32,true,"Conserved plant phosphoproteome - Arabidopsis",61a,20466843,"MASCOT Score",62.0000000,1.0000000,,,,,
FSSSSSFDLTNGGSEETPFPVKR,ph,S,33,true,"PAMP-triggered phosphorylation",48,24601666,"MASCOT Score",20.6100000,,,,,,
FSSSSSFDLTNGGSEETPFPVKR,ph,S,33,true,"Phospho cell culture sucrose/TOR",109,30833711,,,0.9174760,,,,,
FSSSSSFDLTNGGSEETPFPVKR,ph,S,33,true,"Tissue atlas Arabidopsis - ProteomicsDB",114,32188942,"MaxQuant score",341.1500000,0.9813330,,,,0,
FSSSSSFDLTNGGSEETPFPVK,ph,S,33,true,"Large-scale phosphorylation discovery",44,23111157,XCorr,3.6080000,,,,,,
FSSSSSFDLTNGGSEETPFPVK,ph,S,33,true,"srk2dei ABA signaling phopshoproteomics",83,23572148,"MASCOT Score",72.0000000,,,,,,-0.0013000
FSSSSSFDLTNGGSEETPFPVKR,ph,S,41,true,"Tissue atlas Arabidopsis - ProteomicsDB",114,32188942,"MaxQuant score",122.0600000,0.7841410,,,,3.4045101065096E-22,
FSSSSSFDLTNGGSEETPFPVKR,ph,T,44,true,"Tissue atlas Arabidopsis - ProteomicsDB",114,32188942,"MaxQuant score",161.0400000,0.9600990,,,,3.1023402753626E-39,
SQIPTSGK,ph,S,124,true,"Tissue atlas Arabidopsis - ProteomicsDB",114,32188942,"MaxQuant score",88.9480000,0.9999990,,,,0.0070500201545656,
SQIPTSGK,ph,S,129,true,"Tissue atlas Arabidopsis - ProteomicsDB",114,32188942,"MaxQuant score",118.9100000,0.9877160,,,,9.2324800789356E-5,
STWQGSGPTPVLIK,ph,S,148,true,"Tissue atlas Arabidopsis - ProteomicsDB",114,32188942,"MaxQuant score",177.3900000,0.9896610,,,,5.1075398505165E-17,
STWQGSGPTPVLIK,ph,T,151,true,"Tissue atlas Arabidopsis - ProteomicsDB",114,32188942,"MaxQuant score",215.1500000,0.9843260,,,,0,
AEVPWSAKR,ph,S,162,true,"Tissue atlas Arabidopsis - ProteomicsDB",114,32188942,"MaxQuant score",71.1760000,1.0000000,,,,0.0016225799918175,
GILNKLTPEK,ac,K,184,false,"Histone deacetylases - apicidin vs control",98a,29061669,"MaxQuant Score",55.3000000,1.0000000,-0.0690000,0.8472274,NO,0.0089999996125698,
VLLNNCQEAFEGAGK,sno,C,263,true,"hot5-4 / wildtype, FAT-switch S-nitrosoproteome",169,37277371,,,,0.5171533,0.0432073,NO,,
VLLNNCQEAFEGAGK,so,C,263,true,"Arabidopsis S-sulfenylation chemoproteomics",108,31578252,"pFind PSM Score",0.1821720,,,,,,0.8458872
VLLNNCQEAFEGAGK,so,C,263,true,"S-sulfenylation site detection using YAP1C",110,32714340,,,,,,,,
LIGELLKQK,ac,K,312,false,"Quantitative Acetylproteomics",101,29440448,,,,,,,,
PGAMASMR,ph,S,433,true,"Tissue atlas Arabidopsis - ProteomicsDB",114,32188942,"MaxQuant score",93.2260000,1.0000000,,,,8.277809683932E-5,
AAVSGAADGMGLGNILGRPGTGGMMPGMPGTR,ph,S,445,true,"Tissue atlas Arabidopsis - ProteomicsDB",114,32188942,"MaxQuant score",167.1900000,1.0000000,,,,5.7723500440338E-28,
AAVSGAADGMGLGNILGRPGTGGMMPGMPGTR,ph,T,462,true,"Tissue atlas Arabidopsis - ProteomicsDB",114,32188942,"MaxQuant score",41.0210000,0.8594220,,,,0.00059387902729213,
SLSVNSR,ph,S,514,true,"Chloroplast kinase substrates",60,19376835,"MASCOT Score",33.7700000,,,,,,0.4844980
SLSVNSR,ph,S,514,true,"Protein sumoylation and phosphorylation cross-talk",97,28419593,,,,,,,,
SLSVNSR,ph,S,514,true,"TOR Kinase and ABA Receptor",100,29290610,XCorr,2.0830150,0.9842000,,,,0.006721000187099,
SLSVNSR,ph,S,514,true,"Phospho cell culture sucrose/TOR",109,30833711,,,0.9999790,,,,,
SLSVNSR,ph,S,514,true,"Tissue atlas Arabidopsis - ProteomicsDB",114,32188942,"MaxQuant score",137.0600000,1.0000000,,,,0.012279300019145,
LLPQGSGGLLNGGGR,ph,S,524,true,"atm and atr DNA damage response",88,25561503,"MASCOT Score",62.0000000,1.0000000,,,,,-2.0200000
LLPQGSGGLLNGGGR,ph,S,524,true,"Tissue atlas Arabidopsis - ProteomicsDB",114,32188942,"MaxQuant score",122.9300000,1.0000000,,,,2.9995098884683E-6,
SQPQPQPQAAPLANSLNAGELER,ph,S,563,true,"Tissue atlas Arabidopsis - ProteomicsDB",114,32188942,"MaxQuant score",254.3300000,1.0000000,,,,0,
SQPQPQPQAAPLANSLNAGELER,ph,S,577,true,"Tissue atlas Arabidopsis - ProteomicsDB",114,32188942,"MaxQuant score",193.9300000,1.0000000,,,,0,
LVDEALQCVEELK,sno,C,606,true,"hot5-4 / wildtype, FAT-switch S-nitrosoproteome",169,37277371,,,,0.6914856,0.0177568,YES,,
LVDEALQCVEELKSPSYHPELVK,so,C,606,true,"S-sulfenylation site detection using YAP1C",110,32714340,,,,,,,,
