Peptide,PTM,ModifiedAA,ModifiedPosition,PeptideUniqueToGene,ExperimentDesc,ExpID,PubmedID,ScoreType,IdentScore,LocProb,Log2FChange,PQ-val,QuantSig,PEP,MassErrorPPM
LFGGGNKDNNSE,nt,L,52,true,"Arg/N-end rule seed, prt6 vs. Wt",99,29168982,"MASCOT Score",51.4300000,,,,,4.5970000428497E-6,2.7189168
LFGGGNKDNNSEDGQSKAGIFGNMQNMYE,nta,L,52,true,"Arabidopsis translation initiation landscape - NTA",167a,35069635,,,,,,,,
LFGGGNKDNNSE,nta,L,52,true,"Arg/N-end rule seed, prt6 vs. Wt",99,29168982,"MASCOT Score",51.4300000,,-0.3666570,0.0620292,NO,4.5970000428497E-6,2.7189168
KAQMVVQVEAVR,nt,K,84,false,"Arabidopsis translation initiation landscape - NT",167b,35069635,,,,,,,,
ELAAAEFDGYCAGELVK,so,C,109,true,"Arabidopsis S-sulfenylation chemoproteomics",108,31578252,"pFind PSM Score",0.0002418,,,,,,-1.4162996
ELAAAEFDGYCAGELVK,so,C,109,true,"S-sulfenylation site detection using YAP1C",110,32714340,,,,,,,,
DAHAKSVVAMK,ac,K,155,true,"Quantitative Acetylproteomics",101,29440448,,,,,,,,
SVVAMK,mox,M,160,true,"cat2 Methionine oxidation - 1h stress",62a,25693801,"MASCOT Score",38.0000000,,0.0119106,,NO,,
SVVAMK,mox,M,160,true,"cat2 Methionine oxidation - 3h stress",62b,25693801,"MASCOT Score",42.0000000,,-0.0435336,,NO,,
SVVAMKER,ac,K,161,true,"Quantitative Acetylproteomics",101,29440448,,,,,,,,
