Peptide,PTM,ModifiedAA,ModifiedPosition,PeptideUniqueToGene,ExperimentDesc,ExpID,PubmedID,ScoreType,IdentScore,LocProb,Log2FChange,PQ-val,QuantSig,PEP,MassErrorPPM
NGEGESSPSEPK,ph,S,57,true,"atm and atr DNA damage response",88,25561503,"MASCOT Score",46.0000000,0.9640000,,,,,-1.0000000
RAETTNATHMESDTSPQGLSAIDSEFFSSR,ph,S,328,true,"Brassinosteroid-Regulated Phosphorylation Dynamics",94,26187819,"MaxQuant Score",72.4950000,0.9300000,,,,0.00017630000365898,0.8860000
RAETTNATHMESDTSPQGLSAIDSEFFSSR,ph,S,328,true,"Tissue atlas Arabidopsis - ProteomicsDB",114,32188942,"MaxQuant score",120.9900000,0.9926960,,,,1.8357009882655E-42,
RAETTNATHMESDTSPQGLSAIDSEFFSSR,ph,T,330,true,"Brassinosteroid-Regulated Phosphorylation Dynamics",94,26187819,"MaxQuant Score",72.4950000,0.8240000,,,,0.00017630000365898,0.7590000
RAETTNATHMESDTSPQGLSAIDSEFFSSR,ph,S,331,true,"TOR Kinase and ABA Receptor",100,29290610,XCorr,3.1982026,0.7580000,,,,0.0030779999215156,
RAETTNATHMESDTSPQGLSAIDSEFFSSR,ph,S,331,true,"Phospho cell culture sucrose/TOR",109,30833711,,,0.8152650,,,,,
RAETTNATHMESDTSPQGLSAIDSEFFSSR,ph,S,331,true,"Tissue atlas Arabidopsis - ProteomicsDB",114,32188942,"MaxQuant score",167.5000000,0.8494940,,,,0,
AETTNATHMESDTSPQGLSAIDSEFFSSR,ph,S,340,true,"Large-scale phosphorylation discovery",44,23111157,XCorr,3.4420000,,,,,,
NEGSPAVEAPMCGGVTVLGTK,ph,S,459,true,"Tissue atlas Arabidopsis - ProteomicsDB",114,32188942,"MaxQuant score",230.5500000,1.0000000,,,,0,
SLGAVSYR,ph,S,895,true,"Tissue atlas Arabidopsis - ProteomicsDB",114,32188942,"MaxQuant score",72.2760000,0.9995480,,,,0.012236200273037,
SLGTEGNTEAGVSPPLDDSR,ph,S,927,true,"STN8 phosphoproteome",38,21768351,"MASCOT Score",72.7100000,,,,,,-0.2992840
SLGTEGNTEAGVSPPLDDSR,ph,S,927,true,"Conserved plant phosphoproteome - Arabidopsis",61a,20466843,"MASCOT Score",48.0000000,1.0000000,,,,,
SLGTEGNTEAGVSPPLDDSR,ph,S,927,true,"LAXIC - ABA stress",84a,23660473,XCorr,4.6400000,1.0000000,,,,3.1200001103571E-5,
SLGTEGNTEAGVSPPLDDSR,ph,S,927,true,"SnRK2 protein kinase substrates",85,23776212,XCorr,4.3839021,1.0000000,,,,4.7753100085313E-11,
SLGTEGNTEAGVSPPLDDSR,ph,S,927,true,"atm and atr DNA damage response",88,25561503,"MASCOT Score",71.0000000,1.0000000,,,,,0.2900000
SLGTEGNTEAGVSPPLDDSR,ph,S,927,true,"TOR Kinase and ABA Receptor",100,29290610,XCorr,5.8767052,0.9949000,,,,1.49900003521E-9,
SLGTEGNTEAGVSPPLDDSR,ph,S,927,true,"Lateral root-induction - NAA vs control",106,23328941,"MASCOT Score",54.0000000,,,,,,
SLGTEGNTEAGVSPPLDDSR,ph,S,927,true,"Phospho cell culture sucrose/TOR",109,30833711,,,0.9984400,,,,,
SLGTEGNTEAGVSPPLDDSR,ph,S,927,true,"Col-0 callus - FC Col-0 vs. Col-0 Xray",111a,31410901,,61.6400000,,-0.3661112,0.0000000,NO,,1.1794179
SLGTEGNTEAGVSPPLDDSR,ph,S,927,true,"Col-0 X-ray callus - FC Col-0 vs. Col-0 Xray",111b,31410901,,61.6400000,,-0.3661112,0.0000000,NO,,1.1794179
SLGTEGNTEAGVSPPLDDSR,ph,S,927,true,"atm callus - FC atm vs. atm Xray",111c,31410901,,61.6400000,,0.3964884,0.0000000,NO,,1.1794179
SLGTEGNTEAGVSPPLDDSR,ph,S,927,true,"atm-3 X-ray callus - FC atm vs. atm Xray",111d,31410901,,61.6400000,,0.3964884,0.0000000,NO,,1.1794179
SLGTEGNTEAGVSPPLDDSR,ph,S,927,true,"Tissue atlas Arabidopsis - ProteomicsDB",114,32188942,"MaxQuant score",479.4100000,1.0000000,,,,0,
SSVCSPVTCDHVYLFGNDFEDAR,ph,S,1148,true,"Tissue atlas Arabidopsis - ProteomicsDB",114,32188942,"MaxQuant score",119.3500000,0.9977230,,,,3.959629884683E-22,
