Peptide,PTM,ModifiedAA,ModifiedPosition,PeptideUniqueToGene,ExperimentDesc,ExpID,PubmedID,ScoreType,IdentScore,LocProb,Log2FChange,PQ-val,QuantSig,PEP,MassErrorPPM
MEAGKTPPTTTTTTEKKTEQVK,nta,M,1,true,"Arabidopsis translation initiation landscape - NTA",167a,35069635,,,,,,,,
MEAGKTPPTTTTTTEK,ph,T,6,true,"Protein sumoylation and phosphorylation cross-talk",97,28419593,,,,,,,,
MEAGKTPPTTTTTTEK,ph,T,6,true,"Tissue atlas Arabidopsis - ProteomicsDB",114,32188942,"MaxQuant score",180.6200000,0.9998560,,,,9.6971597294628E-27,
DNDLPTDSPYMATGTLEDYK,ph,S,30,true,"srk2dei ABA signaling phopshoproteomics",83,23572148,"MASCOT Score",75.0000000,,,,,,-0.0011000
DNDLPTDSPYMATGTLEDYK,ph,S,30,true,"Lateral root-induction - NAA vs control",106,23328941,"MASCOT Score",34.0000000,,,,,,
DNDLPTDSPYMATGTLEDYK,ph,S,30,true,"Tissue atlas Arabidopsis - ProteomicsDB",114,32188942,"MaxQuant score",159.0400000,0.9983870,,,,8.1987000232904E-29,
AYGAEGHQEPTPGLGGGSTDAPTPSGDAPAATTTDAK,ph,S,62,true,"Lateral root-induction - NAA vs control",106,23328941,"MASCOT Score",40.0000000,,,,,,
AYGAEGHQEPTPGLGGGSTDAPTPSGDAPAATTTDAK,ph,S,62,true,"Tissue atlas Arabidopsis - ProteomicsDB",114,32188942,"MaxQuant score",165.9400000,0.7958470,,,,0,
AYGAEGHQEPTPGLGGGSTDAPTPSGDAPAATTTDAK,ph,T,67,true,"Lateral root-induction - NAA vs control",106,23328941,"MASCOT Score",68.0000000,,0.0451883,0.9201072,NO,,
AYGAEGHQEPTPGLGGGSTDAPTPSGDAPAATTTDAK,ph,T,67,true,"Tissue atlas Arabidopsis - ProteomicsDB",114,32188942,"MaxQuant score",258.8000000,0.9986270,,,,0,
AYGAEGHQEPTPGLGGGSTDAPTPSGDAPAATTTDAK,ph,S,69,true,"Lateral root-induction - NAA vs control",106,23328941,"MASCOT Score",62.0000000,,,,,,
AYGAEGHQEPTPGLGGGSTDAPTPSGDAPAATTTDAK,ph,S,69,true,"Tissue atlas Arabidopsis - ProteomicsDB",114,32188942,"MaxQuant score",221.4600000,0.9967030,,,,0,
