Peptide,PTM,ModifiedAA,ModifiedPosition,PeptideUniqueToGene,ExperimentDesc,ExpID,PubmedID,ScoreType,IdentScore,LocProb,Log2FChange,PQ-val,QuantSig,PEP,MassErrorPPM
VSGHETVSSPGQTELGSGFSNK,ph,S,15,true,"Tissue atlas Arabidopsis - ProteomicsDB",114,32188942,"MaxQuant score",186.7000000,0.9745150,,,,0,
TSTDGFSSSPASAK,ph,S,56,true,"Tissue atlas Arabidopsis - ProteomicsDB",114,32188942,"MaxQuant score",152.1100000,0.8825680,,,,1.3452799407787E-7,
GQEHMLSFSSASGK,fuc,S,89,true,"SPINDLY O-fucosylation",162,36739885,,,,,,,-0.61000001430511,
SRKPVEGQNGHNTNAAAAASAAAASTAAAVSK,fuc,S,253,true,"SPINDLY O-fucosylation",162,36739885,,,,,,,-0.17000000178814,
SDWTQLSMSIPMAPSSPVQDK,ph,S,405,true,"Tissue atlas Arabidopsis - ProteomicsDB",114,32188942,"MaxQuant score",170.0600000,0.8051730,,,,0,
LALSPLR,ph,S,414,true,"TOR Kinase and ABA Receptor",100,29290610,XCorr,2.4526515,1.0000000,,,,0.012109999544919,
FGSSPTGVLQK,ph,S,477,false,"Large-scale phosphorylation discovery",44,23111157,XCorr,4.0170000,,,,,,
FGSSPTGVLQK,ph,S,477,false,"Tissue atlas Arabidopsis - ProteomicsDB",114,32188942,"MaxQuant score",184.4400000,0.9954820,,,,2.8000000525086E-14,
