Peptide,PTM,ModifiedAA,ModifiedPosition,PeptideUniqueToGene,ExperimentDesc,ExpID,PubmedID,ScoreType,IdentScore,LocProb,Log2FChange,PQ-val,QuantSig,PEP,MassErrorPPM
AAIITCGGLCPGLNDVIR,sno,C,187,true,"Site-specific nitrosomeproteomic id - gsnor1-3",90b,25699590,XCorr,2.3759062,,,,,0.24819999933243,-4.2626678
GSAVICVAEGAGQNFLEK,ox,C,405,true,"SPEAR - 10 mM H2O2 / mock",138a,34619326,,,,3.6293279,0.0184845,YES,,
GSAVICVAEGAGQNFLEK,ox,C,405,true,"SPEAR - 50 mM H2O2 / mock",138b,34619326,,,,3.2555089,0.0268909,YES,,
GSAVICVAEGAGQNFLEK,sno,C,405,true,"Site-specific nitrosomeproteomic id - gsnor1-3",90b,25699590,XCorr,2.2400000,,,,,0.0016080000204965,-6.3000000
GSAVICVAEGAGQNFLEK,so,C,405,true,"Arabidopsis S-sulfenylation chemoproteomics",108,31578252,"pFind PSM Score",0.1827630,,,,,,-1.3351317
GSAVICVAEGAGQNFLEK,so,C,405,true,"S-sulfenylation site detection using YAP1C",110,32714340,,,,,,,,
GSAVICVAEGAGQNFLEKTNAK,ph,T,418,true,"SIRK1 phosphorylation",86a,23820729,"MaxQuant Score",113.4200000,1.0000000,,,,0.28099998831749,2.1430000
GSAVICVAEGAGQNFLEKTNAK,ph,T,418,true,"SIRK1 exp - sirk1 mutant vs WT",86b,23820729,,,,-0.4391277,,NO,,
GSAVICVAEGAGQNFLEKTNAK,ph,T,418,true,"SIRK1 exp - 35S:SIRK1 vs WT",86c,23820729,,,,0.3638330,,NO,,
CLTSTGQPDFI,so,C,527,true,"S-sulfenylation site detection using YAP1C",110,32714340,,,,,,,,
