Peptide,PTM,ModifiedAA,ModifiedPosition,PeptideUniqueToGene,ExperimentDesc,ExpID,PubmedID,ScoreType,IdentScore,LocProb,Log2FChange,PQ-val,QuantSig,PEP,MassErrorPPM
SSRICAMAKPNDAETLSSSV,nta,S,2,true,"Arabidopsis translation initiation landscape - NTA",167a,35069635,,,,,,,,
AKPNDAETLSSSVDMSLSPR,nt,A,9,true,"Arg/N-end rule pathway Roots",80,25728785,"MASCOT Score",35.1500000,,,,,0.056030001491308,
AKPNDAETLSSSVDMSLSPR,nt,A,9,true,"N-terminal ChaFRADIC",92,26010716,"MASCOT Score",59.7500000,,,,,3.311999979827E-12,
AKPNDAETLSSSVDMSLSPR,nt,A,9,true,"HUNTER N-terminome: legumain, GluC and trypsin",119,31951383,"MaxQuant score",207.5600000,,,,,,
AKPNDAETLSSSVDMSLSPR,nt,A,9,true,"Arabidopsis translation initiation landscape - NT",167b,35069635,,,,,,,,
AKPNDAETLSSSVDMSLSPR,nta,A,9,true,"FtsH12 N-terminome: WT / FtsH12 knockdown miRNA",118,33216923,"MaxQuant score",121.8300000,,,,,1.6599999526079E-6,
HIVAACSK,ox,C,281,true,"OxiTRAQ Arabidopsis - 5 mM H2O2 versus control",47,24376095,,,,0.1762185,0.0305838,NO,,
HIVAACSK,so,C,281,true,"Arabidopsis S-sulfenylation chemoproteomics",108,31578252,"pFind PSM Score",0.3672880,,,,,,-0.0502958
LQGQVSSGASSIAQK,ph,S,290,true,"Tissue atlas Arabidopsis - ProteomicsDB",114,32188942,"MaxQuant score",128.7100000,0.8560150,,,,2.319980012544E-6,
RDFLVKSLGDIK,ac,K,330,true,"Quantitative Acetylproteomics",101,29440448,,,,,,,,
DFLVKSLGDIK,ac,K,330,true,"Quantitative Acetylproteomics",101,29440448,,,,,,,,
