Peptide,PTM,ModifiedAA,ModifiedPosition,PeptideUniqueToGene,ExperimentDesc,ExpID,PubmedID,ScoreType,IdentScore,LocProb,Log2FChange,PQ-val,QuantSig,PEP,MassErrorPPM
MFIESFK,mox,M,1,false,"cat2 Methionine oxidation - 3h stress",62b,25693801,"MASCOT Score",31.0000000,,1.3283473,,NO,,
DKVQQANYFGSLTQASSIR,ub,K,95,false,"upl3 mutant / wildtype",168,35926874,"MaxQuant score",130.0200000,1.0000000,-0.1976000,0.7854800,NO,4.9234000123327E-14,-1.2049000
VGSYNGEEIYAPFK,ph,S,115,true,"Tissue atlas Arabidopsis - ProteomicsDB",114,32188942,"MaxQuant score",184.0200000,1.0000000,,,,7.4433999386749E-23,
KEQVDHIIK,ub,K,203,false,"upl3 mutant / wildtype",168,35926874,"MaxQuant score",71.4510000,1.0000000,0.2750070,0.8132400,NO,0.0041329897940159,-1.2953000
NCLIGGDDFK,ox,C,300,false,"OxiTRAQ Arabidopsis - 5 mM H2O2 versus control",47,24376095,,,,-0.0239048,0.4066900,NO,,
NCLIGGDDFK,sno,C,300,false,"hot5-4 / wildtype, FAT-switch S-nitrosoproteome",169,37277371,,,,,,,,
YVPYVADSKR,ub,K,396,false,"upl3 mutant / wildtype",168,35926874,"MaxQuant score",93.6670000,1.0000000,0.2041407,0.8119800,NO,0.00050184800056741,-0.6062700
AEGEGKFHSFHPVATILSYLTK,ub,K,452,true,"upl3 mutant / wildtype",168,35926874,"MaxQuant score",162.7200000,1.0000000,-0.5207694,0.4374200,NO,1.9628099981895E-30,0.3632000
APLVPPGTPVVNALSK,ph,T,476,false,"Tissue atlas Arabidopsis - ProteomicsDB",114,32188942,"MaxQuant score",58.8140000,0.9923970,,,,0.0034662699326873,
