Peptide,PTM,ModifiedAA,ModifiedPosition,PeptideUniqueToGene,ExperimentDesc,ExpID,PubmedID,ScoreType,IdentScore,LocProb,Log2FChange,PQ-val,QuantSig,PEP,MassErrorPPM
TSALGWRFPSTNGNGLAPSDTE,nta,T,2,true,"HUNTER N-terminome: legumain, GluC and trypsin",119,31951383,"MaxQuant score",66.3250000,,,,,,
FPSTNGNGLAPSDTER,ph,S,20,true,"atm and atr DNA damage response",88,25561503,"MASCOT Score",59.0000000,1.0000000,,,,,-0.2100000
FPSTNGNGLAPSDTER,ph,S,20,true,"Tissue atlas Arabidopsis - ProteomicsDB",114,32188942,"MaxQuant score",140.8900000,0.9731850,,,,1.1333800147622E-21,
MHDSEPPTPHSTTK,ph,S,33,true,"Large-scale phosphorylation discovery",44,23111157,XCorr,3.3080000,,,,,,
MHDSEPPTPHSTTK,ph,S,33,true,"TOR Kinase and ABA Receptor",100,29290610,XCorr,4.3226075,0.9999000,,,,0.010630000382662,
MHDSEPPTPHSTTK,ph,S,33,true,"Tissue atlas Arabidopsis - ProteomicsDB",114,32188942,"MaxQuant score",128.7400000,1.0000000,,,,1.0508600098547E-5,
MHDSEPPTPHSTTK,ph,T,37,true,"Large-scale phosphorylation discovery",44,23111157,XCorr,3.0450000,,,,,,
MHDSEPPTPHSTTK,ph,T,37,true,"TOR Kinase and ABA Receptor",100,29290610,XCorr,4.3226075,0.9952000,,,,0.010630000382662,
MHDSEPPTPHSTTK,ph,T,37,true,"Tissue atlas Arabidopsis - ProteomicsDB",114,32188942,"MaxQuant score",168.6800000,0.9998890,,,,6.5556898458223E-16,
MHDSEPPTPHSTTK,ph,T,42,true,"TOR Kinase and ABA Receptor",100,29290610,XCorr,4.3226075,0.7995000,,,,0.010630000382662,
TTSMEDPDGTLASVAQCIEQLR,ph,T,50,true,"Large-scale phosphorylation discovery",44,23111157,XCorr,6.0380000,,,,,,
DRTTSMEDPDGTLASVAQCIEQLR,ph,S,52,true,"Large-scale phosphorylation discovery",44,23111157,XCorr,4.1340000,,,,,,
DRTTSMEDPDGTLASVAQCIEQLR,ph,T,59,true,"Large-scale phosphorylation discovery",44,23111157,XCorr,4.9220000,,,,,,
DRTTSMEDPDGTLASVAQCIEQLR,ph,T,59,true,"srk2dei ABA signaling phopshoproteomics",83,23572148,"MASCOT Score",35.0000000,,,,,,-0.0006000
TTSMEDPDGTLASVAQCIEQLR,ph,S,62,true,"srk2dei ABA signaling phopshoproteomics",83,23572148,"MASCOT Score",38.0000000,,,,,,0.0014000
IQAATVLGSLCK,ox,C,134,true,"SPEAR - 10 mM H2O2 / mock",138a,34619326,,,,2.4364154,0.0268328,YES,,
NLCNHSEDIR,sno,C,563,true,"hot5-4 / wildtype, FAT-switch S-nitrosoproteome",169,37277371,,,,0.1784100,0.2560254,NO,,
DCVSSIAK,sno,C,923,true,"hot5-4 / wildtype, FAT-switch S-nitrosoproteome",169,37277371,,,,0.1094695,0.3017914,NO,,
MIENLNETQLCAK,sno,C,968,true,"hot5-4 / wildtype, FAT-switch S-nitrosoproteome",169,37277371,,,,0.7471678,0.1856085,NO,,
QAVQPLVEILNTGSER,nt,Q,1323,true,"HUNTER N-terminome: legumain, GluC and trypsin",119,31951383,"MaxQuant score",109.8400000,,,,,,
ALAVADVEMNAVDVLCR,sno,C,1373,true,"hot5-4 / wildtype, FAT-switch S-nitrosoproteome",169,37277371,,,,0.3537755,0.0486225,NO,,
DRPACK,sno,C,1484,true,"hot5-4 / wildtype, FAT-switch S-nitrosoproteome",169,37277371,,,,0.2012405,0.2099352,NO,,
SHQCEDTAAR,sno,C,1756,true,"Site-specific nitrosomeproteomic id - gsnor1-3",90a,25699590,XCorr,2.2233069,,,,,0.00099640002008528,-6.7869684
SHQCEDTAAR,sno,C,1756,true,"hot5-4 / wildtype, FAT-switch S-nitrosoproteome",169,37277371,,,,,,,,
SHQCEDTAAR,so,C,1756,true,"Arabidopsis S-sulfenylation chemoproteomics",108,31578252,"pFind PSM Score",0.1456120,,1.1473700,,,,-1.6143552
STDAASACR,sno,C,1827,true,"hot5-4 / wildtype, FAT-switch S-nitrosoproteome",169,37277371,,,,,,,,
QAWSACPAEVSR,sno,C,1987,true,"hot5-4 / wildtype, FAT-switch S-nitrosoproteome",169,37277371,,,,,,,,
