Peptide,PTM,ModifiedAA,ModifiedPosition,PeptideUniqueToGene,ExperimentDesc,ExpID,PubmedID,ScoreType,IdentScore,LocProb,Log2FChange,PQ-val,QuantSig,PEP,MassErrorPPM
ASGDVEYRCF,nt,A,2,true,"N-term acetylation drought responses",5,26184543,,,,,,,,
ASGDVEYR,nt,A,2,true,"Arg/N-end rule seed, prt6 vs. Wt",99,29168982,"MASCOT Score",59.8800000,,,,,0.056230001151562,-0.3923542
ASGDVEYRCFVGGLAWATDD,nta,A,2,true,"HUNTER N-terminome: legumain, GluC and trypsin",119,31951383,"MaxQuant score",77.9120000,,,,,,
ASGDVEYRCFVGGLAWATD,nta,A,2,true,"HUNTER N-terminome: legumain, GluC and trypsin",119,31951383,"MaxQuant score",101.3200000,,,,,,
ASGDVEYRCF,nta,A,2,true,"N-term acetylation drought responses",5,26184543,,,,,,,,
ASGDVEYRCF,nta,A,2,true,"Arabidopsis translation initiation landscape - NTA",167a,35069635,,,,,,,,
ASGDVEYR,nta,A,2,true,"Characterization plant N-terminal acetylation",6,22223895,"MASCOT Score",56.3600000,,,,,,
ASGDVEYR,nta,A,2,true,"Arg/N-end rule pathway Roots",80,25728785,"MASCOT Score",47.0300000,,,,,0.14900000393391,
ASGDVEYR,nta,A,2,true,"Arg/N-end rule seed, prt6 vs. Wt",99,29168982,"MASCOT Score",59.8800000,,,,,0.056230001151562,-0.3923542
ASGDVEYR,nta,A,2,true,"FtsH12 N-terminome: WT / FtsH12 knockdown miRNA",118,33216923,"MaxQuant score",70.6850000,,-0.7163942,0.1537102,NO,8.8100001960356E-8,
ASGDVEYR,ph,S,3,true,"atm and atr DNA damage response",88,25561503,"MASCOT Score",57.0000000,1.0000000,,,,,-0.1400000
CFVGGLAWATDDR,acy,C,10,true,"Arabidopsis S-acylation atlas - Meristem",163a,35681017,,,,,,,,
CFVGGLAWATDDR,cn,C,10,true,"Cellular regulation by S-cyanylation",115,30377236,,,,,,,,
CFVGGLAWATDDR,so,C,10,true,"S-sulfenylation site detection using YAP1C",110,32714340,,,,,,,,
FVGGLAWATDDR,nt,F,11,true,"Arg/N-end rule seed, prt6 vs. Wt",99,29168982,"MASCOT Score",49.8400000,,-0.1822662,0.6596745,NO,0.035459998995066,0.1146817
ALETAFAQYGDVIDSKIINDR,nt,A,23,true,"Metacaspase9 substrates - Col-0 / mc9",51a,23964026,"MASCOT Score",76.0000000,,2.7123602,,NO,,-2.5741088
ALETAFAQYGDVIDSKIINDR,nt,A,23,true,"Metacaspase9 substrates - in vitro rMC9",51c,23964026,"MASCOT Score",72.0000000,,,,,,-0.8473666
ALETAFAQYGDVIDSKIINDR,nt,A,23,true,"Arabidopsis translation initiation landscape - NT",167b,35069635,,,,,,,,
TAFAQYGDVIDSKIINDR,nt,T,26,true,"Metacaspase9 substrates - in vitro rMC9",51c,23964026,"MASCOT Score",81.0000000,,1.8591014,,NO,,-1.1084924
DVIDSKIINDR,nt,D,33,false,"Metacaspase9 substrates - 35S:MC9 / mc9",51b,23964026,"MASCOT Score",45.0000000,,1.3277064,,NO,,-1.8121041
ALETAFAQYGDVIDSKIINDRETGR,sumo,K,38,true,"SUMO Ligase SIZ1 heat stress",4,29588388,,,,,,,,
ALETAFAQYGDVIDSKIINDR,ub,K,38,true,"Arabidopsis ubiquitination COFRADIC",40,26744219,"MaxQuant Score",203.8100000,1.0000000,,,,0,0.6100000
ALETAFAQYGDVIDSKIINDR,ub,K,38,true,"upl3 mutant / wildtype",168,35926874,"MaxQuant score",192.6000000,1.0000000,,,,0,3.7464000
SRGFGFVTFKDEK,me1,R,49,false,"Arabidopsis protein methylome",123,31809900,"MaxQuant Score",69.9200000,1.0000000,,,,2.9339500997594E-6,0.1304000
GFGFVTFKDEK,ph,T,55,false,"Tissue atlas Arabidopsis - ProteomicsDB",114,32188942,"MaxQuant score",101.8900000,1.0000000,,,,0.00037202500971034,
GFGFVTFKDEK,ac,K,57,false,"Histone deacetylases - apicidin vs control",98a,29061669,"MaxQuant Score",59.2000000,1.0000000,0.1580000,0.3404082,NO,0.0070000002160668,
GFGFVTFKDEK,ac,K,57,false,"Quantitative Acetylproteomics",101,29440448,,,,,,,,
GFGFVTFKDEK,cr,K,57,false,"Open search Plant PTM Viewer 2.0 - Crotonylation",164c,TBA,,,,,,,,
GFGFVTFKDEK,sumo,K,57,false,"SUMO Ligase SIZ1 heat stress",4,29588388,,,,,,,,
GFGFVTFKDEK,ub,K,57,false,"upl3 mutant / wildtype",168,35926874,"MaxQuant score",103.0800000,1.0000000,0.8391534,0.3587400,NO,0.00038709401269443,-0.7145100
AMKDAIEGMNGQDLDGR,nt,A,61,true,"Arabidopsis translation initiation landscape - NT",167b,35069635,,,,,,,,
AMKDAIEGMNGQDLDGR,ub,K,63,true,"upl3 mutant / wildtype",168,35926874,"MaxQuant score",55.4370000,1.0000000,0.8383467,,,0.00030828101444058,2.1173000
DAIEGMNGQDLDGR,nt,D,64,true,"Metacaspase9 substrates - 35S:MC9 / mc9",51b,23964026,"MASCOT Score",41.0000000,,2.1497043,,NO,,-3.6082741
DAIEGMNGQDLDGR,nt,D,64,true,"Metacaspase9 substrates - in vitro rMC9",51c,23964026,"MASCOT Score",78.0000000,,1.9951301,,NO,,-0.4442515
SITVNEAQSR,nt,S,78,true,"Metacaspase9 substrates - in vitro rMC9",51c,23964026,"MASCOT Score",58.0000000,,2.4049675,,NO,,-0.1704160
SITVNEAQSR,nt,S,78,true,"N-terminal ChaFRADIC",92,26010716,"MASCOT Score",22.1300000,,,,,0.0054049999453127,
SITVNEAQSR,nt,S,78,true,"Arabidopsis translation initiation landscape - NT",167b,35069635,,,,,,,,
SITVNEAQSR,ph,S,78,true,"Tissue atlas Arabidopsis - ProteomicsDB",114,32188942,"MaxQuant score",163.1200000,0.9607610,,,,4.4527300246955E-7,
SITVNEAQSRGSGGGGGHR,ph,S,86,true,"TOR Kinase and ABA Receptor",100,29290610,XCorr,2.5349569,0.8665000,,,,0.00094320002244785,
SITVNEAQSR,ph,S,86,true,"atm and atr DNA damage response",88,25561503,"MASCOT Score",50.0000000,1.0000000,,,,,-0.2400000
SITVNEAQSR,ph,S,86,true,"Tissue atlas Arabidopsis - ProteomicsDB",114,32188942,"MaxQuant score",104.9400000,1.0000000,,,,0.0002945399901364,
GSGGGGGHRGGGGGGYR,me1,R,96,true,"Arabidopsis protein methylome",123,31809900,"MaxQuant Score",65.4670000,1.0000000,,,,4.7124100092333E-5,-1.5077000
SGGGGGYSGGGGSYGGGGGRR,nt,S,105,true,"Arg/N-end rule pathway Roots",80,25728785,"MASCOT Score",35.7000000,,,,,0.011160000227392,
SGGGGGYSGGGGSYGGGGGRR,nt,S,105,true,"N-terminal ChaFRADIC",92,26010716,"MASCOT Score",52.8000000,,,,,4.4099998652847E-10,
SGGGGGYSGGGGSYGGGGGR,nt,S,105,true,"Tic56 chloroplast import - wild-type",89a,25588737,XCorr,5.9399514,,,,,,
SGGGGGYSGGGGSYGGGGGR,nt,S,105,true,"Tic56 chloroplast import - ppi2",89b,25588737,XCorr,6.0112562,,,,,,
SGGGGGYSGGGGSYGGGGGR,nt,S,105,true,"Tic56 chloroplast import - tic56-1",89c,25588737,XCorr,6.0175157,,,,,,
SGGGGGYSGGGGSYGGGGGR,nt,S,105,true,"N-terminal ChaFRADIC",92,26010716,"MASCOT Score",85.0600000,,,,,1.2420000265017E-17,
SGGGGGYSGGGGSYGGGGGR,nt,S,105,true,"Arabidopsis translation initiation landscape - NT",167b,35069635,,,,,,,,
SGGGGGY,nt,S,105,false,"Arg/N-end rule seed, prt6 vs. Wt",99,29168982,"MASCOT Score",49.9300000,,,,,0.21570000052452,-0.6269359
SGGGGGYSGGGGSYGGGGGRR,og,S,105,true,"O-GlcNac Inflorescence Tissue",81,28154133,"MASCOT Score",26.7000000,,,,,,3.7000000
GGGGGGYRSGGGGGYSGGGGSYGGGGGR,ph,S,105,true,"srk2dei ABA signaling phopshoproteomics",83,23572148,"MASCOT Score",64.0000000,,,,,,0.0000000
GGGGGGYRSGGGGGYSGGGGSYGGGGGR,ph,S,105,true,"TOR Kinase and ABA Receptor",100,29290610,XCorr,6.1764402,0.8651000,,,,2.4140000220996E-8,
SGGGGGYSGGGGSYGGGGGRR,ph,S,105,true,"Chloroplast kinase substrates",60,19376835,"MASCOT Score",42.9900000,,,,,,-0.2662520
SGGGGGYSGGGGSYGGGGGR,ph,S,105,true,"Pollen phosphoproteome Arabidopsis",43,22631563,"MASCOT Score",114.8900000,,,,,,
SGGGGGYSGGGGSYGGGGGR,ph,S,105,true,"Chloroplast kinase substrates",60,19376835,"MASCOT Score",104.5400000,,,,,,-0.1683600
SGGGGGYSGGGGSYGGGGGR,ph,S,105,true,"LAXIC - mannitol vs control",84b,23660473,XCorr,5.2900000,1.0000000,,,,2.6899999284069E-5,
SGGGGGYSGGGGSYGGGGGR,ph,S,105,true,"SnRK2 protein kinase substrates",85,23776212,XCorr,2.7156241,0.9900000,,,,1.2994999742943E-8,
SGGGGGYSGGGGSYGGGGGR,ph,S,105,true,"atm and atr DNA damage response",88,25561503,"MASCOT Score",120.0000000,1.0000000,,,,,-0.6400000
SGGGGGYSGGGGSYGGGGGR,ph,S,105,true,"TOR Kinase and ABA Receptor",100,29290610,XCorr,5.2769017,1.0000000,,,,1.7489999448728E-9,
SGGGGGYSGGGGSYGGGGGR,ph,S,105,true,"Lateral root-induction - NAA vs control",106,23328941,"MASCOT Score",86.0000000,,0.1439899,0.6103118,NO,,
SGGGGGYSGGGGSYGGGGGR,ph,S,105,true,"Tissue atlas Arabidopsis - ProteomicsDB",114,32188942,"MaxQuant score",315.9400000,1.0000000,,,,0,
GGGGGYSGGGGSYGGGGGR,nt,G,106,true,"Tic56 chloroplast import - tic56-1",89c,25588737,XCorr,3.8931160,,,,,,
SGGGGGYSGGGGSYGGGGGR,ph,S,112,true,"Tissue atlas Arabidopsis - ProteomicsDB",114,32188942,"MaxQuant score",329.6400000,0.9999990,,,,0,
SGGGGGYSGGGGSYGGGGGRR,ph,S,117,true,"TOR Kinase and ABA Receptor",100,29290610,XCorr,3.1434493,0.7798000,,,,0.00013790000230074,
SGGGGGYSGGGGSYGGGGGR,ph,S,117,true,"atm and atr DNA damage response",88,25561503,"MASCOT Score",125.0000000,0.8870000,,,,,0.7300000
SGGGGGYSGGGGSYGGGGGR,ph,S,117,true,"Lateral root-induction - NAA vs control",106,23328941,"MASCOT Score",78.0000000,,0.0916661,0.7696338,NO,,
SGGGGGYSGGGGSYGGGGGR,ph,S,117,true,"Tissue atlas Arabidopsis - ProteomicsDB",114,32188942,"MaxQuant score",359.0800000,1.0000000,,,,0,
SGGGGGYSGGGGSYGGGGGR,ph,Y,118,true,"Tissue atlas Arabidopsis - ProteomicsDB",114,32188942,"MaxQuant score",64.8420000,0.7587660,,,,0.0013448699610308,
SGGGGGY,nt,S,132,false,"Arg/N-end rule seed, prt6 vs. Wt",99,29168982,"MASCOT Score",49.9300000,,,,,0.21570000052452,-0.6269359
EGGGGYSGGGGGYSSR,ph,S,132,true,"Lateral root-induction - NAA vs control",106,23328941,"MASCOT Score",21.0000000,,,,,,
EGGGGYSGGGGGYSSR,ph,S,132,true,"Tissue atlas Arabidopsis - ProteomicsDB",114,32188942,"MaxQuant score",206.5200000,1.0000000,,,,0,
EGGGGYSGGGGGYSSR,ph,S,139,true,"atm and atr DNA damage response",88,25561503,"MASCOT Score",108.0000000,0.8740000,,,,,0.5300000
EGGGGYSGGGGGYSSR,ph,S,139,true,"Tissue atlas Arabidopsis - ProteomicsDB",114,32188942,"MaxQuant score",169.5800000,0.8837530,,,,5.3944600922092E-37,
EGGGGYSGGGGGYSSRGGGGGSYGGGR,ph,S,140,true,"Tissue atlas Arabidopsis - ProteomicsDB",114,32188942,"MaxQuant score",101.2800000,0.8776000,,,,8.691840234953E-16,
EGGGGYSGGGGGYSSR,ph,S,140,true,"TOR Kinase and ABA Receptor",100,29290610,XCorr,2.7246890,0.8405000,,,,0.00068789999932051,
EGGGGYSGGGGGYSSRGGGGGSYGGGR,me1,R,141,true,"Arabidopsis protein methylome",123,31809900,"MaxQuant Score",228.9500000,1.0000000,,,,0,0.1635100
GGGGGSYGGGR,nt,G,142,true,"Metacaspase9 substrates - in vitro rMC9",51c,23964026,"MASCOT Score",69.0000000,,2.7411988,,NO,,0.3156498
EGGGGYGGGEGGGYGGSGGGGGW,ph,Y,167,true,"Lateral root-induction - NAA vs control",106,23328941,"MASCOT Score",28.0000000,,,,,,
REGGGGYGGGEGGGYGGSGGGGGW,ph,S,170,true,"Tissue atlas Arabidopsis - ProteomicsDB",114,32188942,"MaxQuant score",317.6000000,1.0000000,,,,0,
EGGGGYGGGEGGGYGGSGGGGGW,ph,S,170,true,"Phosphoproteomic analysis of seed maturation",42,22440515,"MASCOT Score",92.0000000,,,,,,-2.1800000
EGGGGYGGGEGGGYGGSGGGGGW,ph,S,170,true,"Pollen phosphoproteome Arabidopsis",43,22631563,"MASCOT Score",66.7900000,,,,,,-1.8126400
EGGGGYGGGEGGGYGGSGGGGGW,ph,S,170,true,"Lateral root-induction - NAA vs control",106,23328941,"MASCOT Score",31.0000000,,,,,,
