Peptide,PTM,ModifiedAA,ModifiedPosition,PeptideUniqueToGene,ExperimentDesc,ExpID,PubmedID,ScoreType,IdentScore,LocProb,Log2FChange,PQ-val,QuantSig,PEP,MassErrorPPM
LSNDNNDSQATVQK,ng,N,169,true,"Conserved N-glycosylation",74,22633491,"MaxQuant Score",171.0500000,0.8400000,,,,5.3640000259669E-33,-0.4710000
EYLLNMTDAQFALR,ng,N,182,true,"Conserved N-glycosylation",74,22633491,"MaxQuant Score",115.2700000,1.0000000,,,,6.2410001611113E-9,-0.5310000
VNVGGPLITPQNDTLGR,ng,N,253,true,"Conserved N-glycosylation",74,22633491,"MaxQuant Score",152.9400000,1.0000000,,,,1.4959999385401E-29,-0.8940000
SNLYNSALGLGR,ph,S,500,true,"Tissue atlas Arabidopsis - ProteomicsDB",114,32188942,"MaxQuant score",164.5300000,1.0000000,,,,3.8990997930366E-12,
SNLYNSALGLGR,ph,S,505,true,"Tissue atlas Arabidopsis - ProteomicsDB",114,32188942,"MaxQuant score",209.2500000,1.0000000,,,,4.2697001703223E-31,
DVAFGQNHVSTAVK,ph,S,682,false,"Pollen phosphoproteome Arabidopsis",43,22631563,"MASCOT Score",51.1900000,,,,,,-1.4582800
DVAFGQNHVSTAVK,ph,S,682,false,"Tissue atlas Arabidopsis - ProteomicsDB",114,32188942,"MaxQuant score",252.8800000,1.0000000,,,,0,
DVAFGQNHVSTAVK,ph,T,683,false,"Pollen phosphoproteome Arabidopsis",43,22631563,"MASCOT Score",51.1900000,,,,,,-1.4582800
DVAFGQNHVSTAVK,ph,T,683,false,"Tissue atlas Arabidopsis - ProteomicsDB",114,32188942,"MaxQuant score",163.2500000,1.0000000,,,,5.4881599287167E-16,
GSFGYLDPEYFR,ph,S,688,false,"Plasmamembrane phosphorylation",20,15308754,,,,,,,,
GSFGYLDPEYFR,ph,S,688,false,"Pollen phosphoproteome Arabidopsis",43,22631563,"MASCOT Score",45.2500000,,,,,,
GSFGYLDPEYFR,ph,S,688,false,"Tyrosine phosphorylation in Arabidopsis",59,18463617,"MASCOT Score",29.0000000,,,,,,-0.9806349
GSFGYLDPEYFR,ph,S,688,false,"TOR Kinase and ABA Receptor",100,29290610,XCorr,3.2853138,0.9999000,,,,0.0030320000369102,
GSFGYLDPEYFR,ph,S,688,false,"Tissue atlas Arabidopsis - ProteomicsDB",114,32188942,"MaxQuant score",101.3900000,0.9999880,,,,0.00012155299918959,
AEAEEVETPKPVAVPAAAPTSPAATTAAASERPVSQTEEK,ph,T,816,true,"Tissue atlas Arabidopsis - ProteomicsDB",114,32188942,"MaxQuant score",58.0890000,0.9999340,,,,1.9816400254058E-6,
