Peptide,PTM,ModifiedAA,ModifiedPosition,PeptideUniqueToGene,ExperimentDesc,ExpID,PubmedID,ScoreType,IdentScore,LocProb,Log2FChange,PQ-val,QuantSig,PEP,MassErrorPPM
SRSPFSHR,ph,S,12,true,"TOR Kinase and ABA Receptor",100,29290610,XCorr,3.0053744,0.9112000,,,,0.0029649999924004,
RPPSPYSSASSTSSSLINNR,ph,S,21,true,"Tissue atlas Arabidopsis - ProteomicsDB",114,32188942,"MaxQuant score",127.4900000,0.7821380,,,,5.9943698632477E-18,
SSSTPTSTVYNSGGVTGSR,ph,S,44,true,"atm and atr DNA damage response",88,25561503,"MASCOT Score",42.0000000,0.9770000,,,,,-0.3000000
SSSTPTSTVYNSGGVTGSR,ph,S,44,true,"Tissue atlas Arabidopsis - ProteomicsDB",114,32188942,"MaxQuant score",133.9300000,0.9450600,,,,3.5158400052659E-15,
SSSTPTSTVYNSGGVTGSR,ph,T,45,true,"Tissue atlas Arabidopsis - ProteomicsDB",114,32188942,"MaxQuant score",146.8100000,0.8086400,,,,2.3697599584011E-17,
SISAGKDDK,ph,S,529,true,"atm and atr DNA damage response",88,25561503,"MASCOT Score",21.0000000,1.0000000,,,,,-1.4700000
FKDENSPVGSR,ph,S,571,true,"atm and atr DNA damage response",88,25561503,"MASCOT Score",48.0000000,0.9940000,,,,,-0.1400000
FKDENSPVGSR,ph,S,571,true,"Tissue atlas Arabidopsis - ProteomicsDB",114,32188942,"MaxQuant score",125.8800000,0.9999190,,,,2.3669399524806E-5,
ANSGALSIQK,ph,S,920,true,"Tissue atlas Arabidopsis - ProteomicsDB",114,32188942,"MaxQuant score",128.7300000,0.9999690,,,,5.5475297813246E-6,
