Peptide,PTM,ModifiedAA,ModifiedPosition,PeptideUniqueToGene,ExperimentDesc,ExpID,PubmedID,ScoreType,IdentScore,LocProb,Log2FChange,PQ-val,QuantSig,PEP,MassErrorPPM
SHVAPSALTVRAASAYADE,nt,S,37,true,"HUNTER N-terminome: legumain, GluC and trypsin",119,31951383,"MaxQuant score",82.0100000,,,,,,
SHVAPSALTVRAASAYA,nt,S,37,true,"Arabidopsis translation initiation landscape - NT",167b,35069635,,,,,,,,
AASAYADELVKTAK,nt,A,48,true,"Stromal N-terminome",96,26371235,"MASCOT Score",41.5900000,,,,,,
AASAYADE,nt,A,48,true,"N-terminal ChaFRADIC",92,26010716,"MASCOT Score",65.8900000,,,,,0.10230000317097,
ASAYADELVKTAKTIASPGHGIMAMDESNATCGKR,nt,A,49,true,"Stromal N-terminome",96,26371235,"MASCOT Score",85.0800000,,,,,,
ASAYADELVKTAKTIASPGHGIMAMDESNATCGKR,nt,A,49,true,"HUNTER N-terminome: legumain, GluC and trypsin",119,31951383,"MaxQuant score",52.6970000,,,,,,
ASAYADELVKTAKTIASPGHGIMAMDESN,nt,A,49,true,"HUNTER N-terminome: legumain, GluC and trypsin",119,31951383,"MaxQuant score",151.6500000,,,,,,
ASAYADELVKTAKTIASPGHGIMAMD,nt,A,49,true,"HUNTER N-terminome: legumain, GluC and trypsin",119,31951383,"MaxQuant score",84.6020000,,,,,,
ASAYADELVKT,nt,A,49,true,"N-terminal ChaFRADIC",92,26010716,"MASCOT Score",42.7900000,,,,,6.881000302883E-8,
ASAYADE,nt,A,49,true,"N-terminal ChaFRADIC",92,26010716,"MASCOT Score",56.4400000,,,,,0.093170002102852,
ASAYADE,nt,A,49,true,"Arg/N-end rule seed, prt6 vs. Wt",99,29168982,"MASCOT Score",47.4900000,,-0.2777803,0.2645237,NO,0.052740000188351,-0.2078502
SPGHGIMAMDESNATCGKR,nt,S,65,true,"HUNTER N-terminome: legumain, GluC and trypsin",119,31951383,"MaxQuant score",47.0900000,,,,,,
SPGHGIM,nt,S,65,true,"N-terminal ChaFRADIC",92,26010716,"MASCOT Score",20.5000000,,,,,0.038410000503063,
TIASPGHGIMAMDESNATCGK,ph,S,65,true,"atm and atr DNA damage response",88,25561503,"MASCOT Score",71.0000000,1.0000000,,,,,-0.2500000
TIASPGHGIMAMDESNATCGK,ph,S,65,true,"TOR Kinase and ABA Receptor",100,29290610,XCorr,4.1360192,0.9966000,,,,3.7899999369984E-6,
TIASPGHGIMAMDESNATCGK,ph,S,65,true,"Phospho cell culture sucrose/TOR",109,30833711,,,0.9839920,,,,,
TIASPGHGIMAMDESNATCGK,ph,S,65,true,"Tissue atlas Arabidopsis - ProteomicsDB",114,32188942,"MaxQuant score",191.6600000,0.9999950,,,,0,
SNATCGKRLASIGLE,nt,S,76,true,"N-terminal ChaFRADIC",92,26010716,"MASCOT Score",20.4500000,,,,,1.8860000636778E-5,
TIASPGHGIMAMDESNATCGK,acy,C,80,true,"Arabidopsis S-acylation atlas - Meristem",163a,35681017,,,,,,,,
TAKTIASPGHGIMAMDESNATCGK,ox,C,80,true,"SPEAR - 10 mM H2O2 / mock",138a,34619326,,,,1.7891755,0.0408720,YES,,
TIASPGHGIMAMDESNATCGK,sno,C,80,true,"Site-specific nitrosomeproteomic id - gsnor1-3",90a,25699590,XCorr,5.0919485,,,,,1.1200000216149E-7,-5.0225526
TIASPGHGIMAMDESNATCGK,sno,C,80,true,"Site-specific nitrosomeproteomic id - gsnor1-3",90b,25699590,XCorr,4.7100000,,,,,9.3870003183838E-6,-7.2100000
TIASPGHGIMAMDESNATCGK,sno,C,80,true,"hot5-4 / wildtype, FAT-switch S-nitrosoproteome",169,37277371,,,,-0.3384622,0.0551353,NO,,
TIASPGHGIMAMDESNATCGK,so,C,80,true,"Arabidopsis S-sulfenylation chemoproteomics",108,31578252,"pFind PSM Score",0.0083188,,1.3201500,,,,-1.0079206
LASIGLENTEANR,nt,L,84,true,"Stromal N-terminome",96,26371235,"MASCOT Score",58.3600000,,,,,,
SIGLENTEANRQAY,nt,S,86,true,"Arabidopsis translation initiation landscape - NT",167b,35069635,,,,,,,,
LASIGLENTEANR,ph,S,86,true,"atm and atr DNA damage response",88,25561503,"MASCOT Score",25.0000000,1.0000000,,,,,-0.5700000
LASIGLENTEANR,ph,S,86,true,"Tissue atlas Arabidopsis - ProteomicsDB",114,32188942,"MaxQuant score",129.2900000,1.0000000,,,,6.6192900703754E-5,
KMVDVLVEQNIVPGIK,ac,K,132,false,"Histone deacetylases - apicidin vs control",98a,29061669,"MaxQuant Score",48.9000000,1.0000000,-0.0970000,0.7585776,NO,9.9999997473788E-5,
QNIVPGIKVDKGLVPLVGSYDE,nt,Q,140,true,"HUNTER N-terminome: legumain, GluC and trypsin",119,31951383,"MaxQuant score",115.8200000,,,,,,
VDKGLVPLVGSYDESWCQGLDGLASR,ac,K,150,true,"Histone deacetylases- hda14 vs WT (low light)",98c,29061669,"MaxQuant Score",198.9900000,1.0000000,-0.9020000,0.9885531,NO,1.6999999452055E-28,
GLVPLVGSYDESWCQGLDGLASR,ox,C,164,true,"OxiTRAQ SA and flg22 responses - SA vs mock",91a,25720653,"MASCOT Score",30.5600000,,1.2078929,0.0000000,YES,,
GLVPLVGSYDESWCQGLDGLASR,ox,C,164,true,"OxiTRAQ SA and flg22 responses - flg22 vs mock",91b,25720653,"MASCOT Score",30.5600000,,0.5160151,0.8160000,NO,,
GLVPLVGSYDESWCQGLDGLASR,so,C,164,true,"S-sulfenylation site detection using YAP1C",110,32714340,,,,,,,,
TVVSIPNGPSALAVKE,nt,T,189,false,"HUNTER N-terminome: legumain, GluC and trypsin",119,31951383,"MaxQuant score",64.6500000,,,,,,
WRTVVSIPNGPSALAVK,ph,T,189,false,"Tissue atlas Arabidopsis - ProteomicsDB",114,32188942,"MaxQuant score",57.2200000,0.9406310,,,,0.00069662998430431,
TVVSIPNGPSALAVK,ph,S,192,false,"TOR Kinase and ABA Receptor",100,29290610,XCorr,2.5309067,0.9742000,,,,0.0040859999135137,
TVVSIPNGPSALAVK,ph,S,192,false,"Tissue atlas Arabidopsis - ProteomicsDB",114,32188942,"MaxQuant score",138.8100000,0.9999800,,,,6.4646400232959E-7,
GPSALAVKE,nt,G,196,false,"Arg/N-end rule seed, prt6 vs. Wt",99,29168982,"MASCOT Score",29.5400000,,,,,0.00021129999367986,-1.4827971
TVVSIPNGPSALAVKEAAWGLAR,ac,K,203,false,"Histone deacetylases- hda14 vs WT (low light)",98c,29061669,"MaxQuant Score",163.1800000,1.0000000,-1.4380000,0.9183326,NO,1.9999999649033E-14,
TVVSIPNGPSALAVK,ac,K,203,false,"Quantitative Acetylproteomics",101,29440448,,,,,,,,
GLVPIVEPE,nt,G,220,false,"Arg/N-end rule seed, prt6 vs. Wt",99,29168982,"MASCOT Score",57.5400000,,,,,0.0035119999665767,-1.1699265
AQNNVMFE,nt,A,256,false,"Arg/N-end rule seed, prt6 vs. Wt",99,29168982,"MASCOT Score",44.3200000,,,,,0.028699999675155,-0.8877455
QNNVMFE,nt,Q,257,false,"Arg/N-end rule seed, prt6 vs. Wt",99,29168982,"MASCOT Score",49.5500000,,,,,0.048530001193285,-0.4171358
MVTPGAEATDR,nt,M,271,true,"Arg/N-end rule seed, prt6 vs. Wt",99,29168982,"MASCOT Score",50.0300000,,-0.7669546,0.0429225,NO,0.0096140000969172,-1.4580232
ATPEQVASYTLKLLR,nt,A,282,true,"Arabidopsis translation initiation landscape - NT",167b,35069635,,,,,,,,
ATPEQVASYTLKLLR,co2,K,293,true,"Carbon dioxide modifications Arabidopsis",121,30082797,,,,,,,,
FLSGGQSE,nt,F,308,false,"Arg/N-end rule seed, prt6 vs. Wt",99,29168982,"MASCOT Score",49.5100000,,,,,0.0094910003244877,0.4503057
SGGQSELEAT,nt,S,310,true,"N-terminal ChaFRADIC",92,26010716,"MASCOT Score",23.7200000,,,,,8.0140001955442E-5,
QAPNPWHVSFSYARALQN,nt,Q,327,false,"HUNTER N-terminome: legumain, GluC and trypsin",119,31951383,"MaxQuant score",132.6400000,,,,,,
ALQNTCLK,ox,C,346,false,"OxiTRAQ Arabidopsis - 5 mM H2O2 versus control",47,24376095,,,,0.1995188,0.2102756,NO,,
ALQNTCLK,sno,C,346,false,"Cold stress nitrosylation - 4°C vs 22°C",65,24388526,,,,1.2630344,,NO,,
ALQNTCLK,sno,C,346,false,"hot5-4 / wildtype, FAT-switch S-nitrosoproteome",169,37277371,,,,,,,,
ALQNTCLK,so,C,346,false,"Arabidopsis S-sulfenylation chemoproteomics",108,31578252,"pFind PSM Score",0.0744135,,0.9957700,,,,0.7313112
ALQNTCLK,so,C,346,false,"S-sulfenylation site detection using YAP1C",110,32714340,,,,,,,,
ALQNTCLKTWGGK,ac,K,348,true,"Histone deacetylases substrates - TSA vs control",98b,29061669,"MaxQuant Score",79.9000000,1.0000000,0.8270000,0.6338697,NO,9.0000001364388E-5,
ALQNTCLKTWGGK,ac,K,348,true,"Histone deacetylases- hda14 vs WT (low light)",98c,29061669,"MaxQuant Score",145.9200000,1.0000000,-0.0790000,0.9931160,NO,9.4000000672168E-7,
TWGGKEENVK,ac,K,353,false,"Histone deacetylases- hda14 vs WT (low light)",98c,29061669,"MaxQuant Score",108.7200000,1.0000000,-0.0640000,0.9931160,NO,0.0040000001899898,
TWGGKEENVK,ac,K,353,false,"Quantitative Acetylproteomics",101,29440448,,,,,,,,
AKANSLAQLGK,ac,K,369,false,"Quantitative Acetylproteomics",101,29440448,,,,,,,,
ANSLAQLGK,ph,S,372,false,"atm and atr DNA damage response",88,25561503,"MASCOT Score",42.0000000,1.0000000,,,,,-1.1100000
ANSLAQLGKYTGEGESEEAK,ac,K,378,false,"Histone deacetylases - apicidin vs control",98a,29061669,"MaxQuant Score",128.0000000,1.0000000,-0.0430000,0.8609938,NO,0,
ANSLAQLGKYTGEGESEEAK,ac,K,378,false,"Histone deacetylases substrates - TSA vs control",98b,29061669,"MaxQuant Score",128.0000000,1.0000000,0.1180000,0.9977001,NO,0,
ANSLAQLGKYTGEGESEEAK,ac,K,378,false,"Histone deacetylases- hda14 vs WT (low light)",98c,29061669,"MaxQuant Score",116.9400000,1.0000000,-1.9810000,0.2992265,NO,3.0999999580672E-6,
ANSLAQLGKYTGEGESEEAK,ac,K,378,false,"Histone deacetylases substrates - hda14 vs WT",98e,29061669,"MaxQuant Score",137.0000000,1.0000000,0.0720000,0.9162205,NO,8.0995051237974E-43,
ANSLAQLGKYTGEGESEEAK,ac,K,378,false,"Quantitative Acetylproteomics",101,29440448,,,,,,,,
YTGEGESEEAK,ph,S,385,false,"atm and atr DNA damage response",88,25561503,"MASCOT Score",58.0000000,1.0000000,,,,,-0.3600000
YTGEGESEEAK,ph,S,385,false,"Tissue atlas Arabidopsis - ProteomicsDB",114,32188942,"MaxQuant score",100.0200000,1.0000000,,,,8.4893697930966E-5,
YTGEGESEEAK,ac,K,389,false,"Quantitative Acetylproteomics",101,29440448,,,,,,,,
YTGEGESEEAKEGMFVKGYTY,me3,K,389,false,"Arabidopsis protein methylome",123,31809900,"MaxQuant Score",204.4700000,1.0000000,,,,0,0.2853200
YTGEGESEEAKEGMFVKGYTY,ac,K,395,false,"Lysine acetylation gel-based Finkemeier et al",37,21311031,i-probability,1.0000000,,,,,,
EGMFVKGYTY,me2,K,395,false,"Arabidopsis protein methylome",123,31809900,"MaxQuant Score",141.7800000,1.0000000,,,,0,2.1659000
GMFVKGYTY,me2,K,395,false,"Arabidopsis protein methylome",123,31809900,"MaxQuant Score",83.6470000,1.0000000,,,,0.008319029584527,-0.2277200
YTGEGESEEAKEGMFVKGYTY,me3,K,395,false,"Arabidopsis protein methylome",123,31809900,"MaxQuant Score",204.4700000,1.0000000,,,,0,0.2853200
GMFVKGYTY,me3,K,395,false,"Arabidopsis protein methylome",123,31809900,"MaxQuant Score",81.9720000,1.0000000,,,,0.010066700167954,-0.2341400
