Peptide,PTM,ModifiedAA,ModifiedPosition,PeptideUniqueToGene,ExperimentDesc,ExpID,PubmedID,ScoreType,IdentScore,LocProb,Log2FChange,PQ-val,QuantSig,PEP,MassErrorPPM
GGGGDTTDTNMMQR,nt,G,2,true,"Arg/N-end rule pathway Roots",80,25728785,"MASCOT Score",58.8400000,,,,,3.9360002119793E-6,
GGGGDTTDTNMMQR,nt,G,2,true,"Arg/N-end rule seed, prt6 vs. Wt",99,29168982,"MASCOT Score",58.3100000,,-0.5818428,0.2364245,NO,0.025569999590516,-0.5854013
GGGGDTTDTNMMQR,nta,G,2,true,"FtsH12 N-terminome: WT / FtsH12 knockdown miRNA",118,33216923,"MaxQuant score",354.3800000,,,,,0,
VNSSSGTSSSSIPK,ph,S,18,true,"Protein sumoylation and phosphorylation cross-talk",97,28419593,,,,,,,,
VNSSSGTSSSSIPK,ph,S,18,true,"TOR Kinase and ABA Receptor",100,29290610,XCorr,4.4151888,0.9937000,,,,0.00029860000358894,
VNSSSGTSSSSIPK,ph,S,18,true,"Lateral root-induction - NAA vs control",106,23328941,"MASCOT Score",26.0000000,,,,,,
VNSSSGTSSSSIPK,ph,S,18,true,"Tissue atlas Arabidopsis - ProteomicsDB",114,32188942,"MaxQuant score",236.4000000,0.9990300,,,,0,
TGAGFSPSLPPSPFTMCHSSSSR,ph,S,113,true,"Tissue atlas Arabidopsis - ProteomicsDB",114,32188942,"MaxQuant score",97.3040000,0.9842920,,,,1.1047999537786E-12,
TGAGFSPSLPPSPFTMCHSSSSR,ph,S,119,true,"Tissue atlas Arabidopsis - ProteomicsDB",114,32188942,"MaxQuant score",74.3000000,0.8933810,,,,1.8530799650307E-7,
RSNSDVTFGFSSMMSQNQK,ph,S,147,true,"atm and atr DNA damage response",88,25561503,"MASCOT Score",50.0000000,0.9580000,,,,,-0.9700000
RSNSDVTFGFSSMMSQNQK,ph,S,147,true,"TOR Kinase and ABA Receptor",100,29290610,XCorr,5.3500776,0.9079000,,,,5.1319998419785E-6,
RSNSDVTFGFSSMMSQNQK,ph,S,147,true,"Tissue atlas Arabidopsis - ProteomicsDB",114,32188942,"MaxQuant score",147.0800000,0.7603770,,,,1.80485991332E-18,
SNSDVTFGFSSMMSQNQK,ph,S,149,true,"atm and atr DNA damage response",88,25561503,"MASCOT Score",51.0000000,0.9090000,,,,,0.2100000
SNSDVTFGFSSMMSQNQK,ph,S,149,true,"Lateral root-induction - NAA vs control",106,23328941,"MASCOT Score",28.0000000,,,,,,
SNSDVTFGFSSMMSQNQK,ph,S,149,true,"Tissue atlas Arabidopsis - ProteomicsDB",114,32188942,"MaxQuant score",250.3100000,0.9991660,,,,0,
SPPLSSLER,ph,S,165,true,"STN8 phosphoproteome",38,21768351,"MASCOT Score",46.2300000,,,,,,-0.1194390
SPPLSSLER,ph,S,165,true,"atm and atr DNA damage response",88,25561503,"MASCOT Score",24.0000000,1.0000000,,,,,-0.4600000
SPPLSSLER,ph,S,165,true,"Phospho cell culture sucrose/TOR",109,30833711,,,0.9999600,,,,,
SPPLSSLER,ph,S,165,true,"Col-0 callus - FC Col-0 vs. Col-0 Xray",111a,31410901,,45.4300000,,-0.3419269,0.0000000,NO,,1.8452184
SPPLSSLER,ph,S,165,true,"Col-0 X-ray callus - FC Col-0 vs. Col-0 Xray",111b,31410901,,45.4300000,,-0.3419269,0.0000000,NO,,1.8452184
SPPLSSLER,ph,S,165,true,"atm callus - FC atm vs. atm Xray",111c,31410901,,45.4300000,,-0.4817921,0.0000000,NO,,1.8452184
SPPLSSLER,ph,S,165,true,"atm-3 X-ray callus - FC atm vs. atm Xray",111d,31410901,,45.4300000,,-0.4817921,0.0000000,NO,,1.8452184
SPPLSSLER,ph,S,165,true,"Tissue atlas Arabidopsis - ProteomicsDB",114,32188942,"MaxQuant score",143.5000000,1.0000000,,,,9.2491500254255E-5,
SISGEDTSDWSNLVK,ph,S,174,true,"PAMP-triggered phosphorylation",48,24601666,"MASCOT Score",60.7000000,,,,,,
SISGEDTSDWSNLVK,ph,S,174,true,"srk2dei ABA signaling phopshoproteomics",83,23572148,"MASCOT Score",50.0000000,,,,,,0.0009000
SISGEDTSDWSNLVK,ph,S,176,true,"ABA-induced protein phosphorylation",35,20733066,,,,,,,,
SISGEDTSDWSNLVK,ph,S,176,true,"Tyrosine phosphorylation in Arabidopsis",59,18463617,"MASCOT Score",64.0000000,,,,,,-0.5242545
SISGEDTSDWSNLVK,ph,S,176,true,"srk2dei ABA signaling phopshoproteomics",83,23572148,"MASCOT Score",83.0000000,,,,,,0.0003000
SISGEDTSDWSNLVK,ph,S,176,true,"LAXIC - ABA stress",84a,23660473,XCorr,5.0700000,0.9610000,,,,0.011224900372326,
SISGEDTSDWSNLVK,ph,S,176,true,"LAXIC - mannitol vs control",84b,23660473,XCorr,4.9300000,0.9650000,1.5677707,,NO,2.4199999870689E-7,
SISGEDTSDWSNLVK,ph,S,176,true,"SnRK2 protein kinase substrates",85,23776212,XCorr,4.5250463,0.9650000,,,,0.0049467501230538,
SISGEDTSDWSNLVK,ph,S,176,true,"atm and atr DNA damage response",88,25561503,"MASCOT Score",76.0000000,1.0000000,,,,,-1.3400000
SISGEDTSDWSNLVK,ph,S,176,true,"TOR Kinase and ABA Receptor",100,29290610,XCorr,5.1413693,0.9226000,,,,6.9930003121499E-8,
SISGEDTSDWSNLVK,ph,S,176,true,"Lateral root-induction - NAA vs control",106,23328941,"MASCOT Score",37.0000000,,,,,,
SISGEDTSDWSNLVK,ph,S,176,true,"Phospho cell culture sucrose/TOR",109,30833711,,,0.9999990,,,,,
SISGEDTSDWSNLVK,ph,S,176,true,"Tissue atlas Arabidopsis - ProteomicsDB",114,32188942,"MaxQuant score",328.4100000,1.0000000,,,,0,
SISGEDTSDWSNLVK,ph,S,176,true,"Touch-induced phosphorylation: 40s touch vs untouc",136,30291188,"MASCOT score",97.5700000,,0.2030406,0.7084524,NO,,1.1509588
SISGEDTSDWSNLVK,ph,T,180,true,"Tissue atlas Arabidopsis - ProteomicsDB",114,32188942,"MaxQuant score",239.8900000,0.9612270,,,,0,
SISGEDTSDWSNLVKKEPR,sumo,K,188,true,"SUMO Ligase SIZ1 heat stress",4,29588388,,,,,,,,
SISGEDTSDWSNLVKKEPR,sumo,K,189,true,"SUMO Ligase SIZ1 heat stress",4,29588388,,,,,,,,
VALSSSSSGVK,ph,S,275,true,"atm and atr DNA damage response",88,25561503,"MASCOT Score",39.0000000,1.0000000,,,,,-0.0700000
VALSSSSSGVKR,ph,S,277,true,"atm and atr DNA damage response",88,25561503,"MASCOT Score",30.0000000,1.0000000,,,,,-0.1200000
VALSSSSSGVK,ph,S,277,true,"atm and atr DNA damage response",88,25561503,"MASCOT Score",52.0000000,0.9850000,,,,,-1.3200000
VALSSSSSGVKR,ph,S,278,true,"atm and atr DNA damage response",88,25561503,"MASCOT Score",30.0000000,1.0000000,,,,,-0.1200000
VALSSSSSGVKR,ph,S,278,true,"Tissue atlas Arabidopsis - ProteomicsDB",114,32188942,"MaxQuant score",134.3700000,0.7615920,,,,2.9160698886699E-6,
VALSSSSSGVK,ph,S,278,true,"atm and atr DNA damage response",88,25561503,"MASCOT Score",72.0000000,0.9940000,,,,,-1.1600000
VALSSSSSGVKR,ph,S,279,true,"atm and atr DNA damage response",88,25561503,"MASCOT Score",30.0000000,1.0000000,,,,,-0.1200000
VALSSSSSGVKR,ph,S,279,true,"Tissue atlas Arabidopsis - ProteomicsDB",114,32188942,"MaxQuant score",140.9100000,0.8643610,,,,5.136490131008E-7,
VALSSSSSGVK,ph,S,279,true,"atm and atr DNA damage response",88,25561503,"MASCOT Score",72.0000000,1.0000000,,,,,-1.1600000
SVSMDSCFMGK,ph,S,300,true,"Tyrosine phosphorylation in Arabidopsis",59,18463617,"MASCOT Score",84.0000000,,,,,,-0.5273212
SVSMDSCFMGK,ph,S,300,true,"Conserved plant phosphoproteome - Arabidopsis",61a,20466843,"MASCOT Score",84.0000000,1.0000000,,,,,
SVSMDSCFMGK,ph,S,300,true,"srk2dei ABA signaling phopshoproteomics",83,23572148,"MASCOT Score",81.0000000,,,,,,0.0003000
SVSMDSCFMGK,ph,S,300,true,"SnRK2 protein kinase substrates",85,23776212,XCorr,2.9671400,0.9590000,,,,1.6832100300235E-5,
SVSMDSCFMGK,ph,S,300,true,"atm and atr DNA damage response",88,25561503,"MASCOT Score",48.0000000,1.0000000,,,,,-1.1700000
SVSMDSCFMGK,ph,S,300,true,"TOR Kinase and ABA Receptor",100,29290610,XCorr,3.2059820,0.8894000,,,,0.0035550000611693,
SVSMDSCFMGK,ph,S,300,true,"Lateral root-induction - NAA vs control",106,23328941,"MASCOT Score",35.0000000,,,,,,
SVSMDSCFMGK,ph,S,300,true,"Phospho cell culture sucrose/TOR",109,30833711,,,0.9999090,,,,,
SVSMDSCFMGK,ph,S,300,true,"Tissue atlas Arabidopsis - ProteomicsDB",114,32188942,"MaxQuant score",170.0400000,0.9999820,,,,3.3464600448369E-12,
VSPTNSGEGNSSAYSVEFGNSEFTAAEMKK,ph,S,328,true,"Tissue atlas Arabidopsis - ProteomicsDB",114,32188942,"MaxQuant score",140.4100000,0.9927440,,,,0,
DSMGLTNQNSELKFR,ub,K,434,true,"Arabidopsis ubiquitination COFRADIC",40,26744219,"MaxQuant Score",76.7590000,1.0000000,,,,2.4569999368396E-6,1.2110000
DALSEKLNEEVQR,ub,K,453,true,"Arabidopsis ubiquitination COFRADIC",40,26744219,"MaxQuant Score",156.1400000,1.0000000,,,,8.9240011142369E-40,-0.1210000
