Peptide,PTM,ModifiedAA,ModifiedPosition,PeptideUniqueToGene,ExperimentDesc,ExpID,PubmedID,ScoreType,IdentScore,LocProb,Log2FChange,PQ-val,QuantSig,PEP,MassErrorPPM
QSDAEDHSSLVDDVVGENTDDAVEEDDHDLD,nt,Q,25,true,"HUNTER N-terminome: legumain, GluC and trypsin",119,31951383,"MaxQuant score",61.1120000,,,,,,
QSDAEDHSSLVDDVVGENTDDAVEE,nt,Q,25,true,"HUNTER N-terminome: legumain, GluC and trypsin",119,31951383,"MaxQuant score",76.2100000,,,,,,
QSDAEDHSSLVDDVVGEN,nt,Q,25,true,"HUNTER N-terminome: legumain, GluC and trypsin",119,31951383,"MaxQuant score",150.3400000,,,,,,
QSDAEDHSSLVDDVVGE,nt,Q,25,true,"HUNTER N-terminome: legumain, GluC and trypsin",119,31951383,"MaxQuant score",171.2900000,,,,,,
SDAEDHSSLVDDVVGENTDDAVEE,nt,S,26,true,"HUNTER N-terminome: legumain, GluC and trypsin",119,31951383,"MaxQuant score",88.5550000,,,,,,
SDAEDHSSLVDDVVGEN,nt,S,26,true,"HUNTER N-terminome: legumain, GluC and trypsin",119,31951383,"MaxQuant score",97.9530000,,,,,,
SDAEDHSSLVDDVVGE,nt,S,26,true,"HUNTER N-terminome: legumain, GluC and trypsin",119,31951383,"MaxQuant score",113.0300000,,,,,,
LVPAGEETELLVGLKNEGK,ac,K,91,true,"Quantitative Acetylproteomics",101,29440448,,,,,,,,
LLVQNLTMLR,ng,N,119,true,"Conserved N-glycosylation",74,22633491,"MaxQuant Score",182.6200000,1.0000000,,,,4.8329999724483E-11,0.6650000
LLVQNLTMLR,ng,N,119,true,"N-glycan occupancy Arabidopsis glycoproteins",87,23994444,"Ladder score",84.2000000,,,,,,
LLVQNLTMLR,ng,N,119,true,"N-Glycopeptide Profiling in Arabidopsis Infloresce",132,27067053,"MOWSE score",24.5000000,,,,,0.0063999998383224,
LLVQNLTMLR,ng,N,119,true,"N-linked Glycan Micro-heterogeneity Arabidopsis",134,29237727,,,,,,,,
LLVQNLTMLR,ng,N,119,true,"UDP-GlcNAc transporter glycopeptide analysis",135,30224661,,,,,,,7.1720563710187E-8,0.6000000
KVSKVEVGTR,ph,S,223,true,"Tissue atlas Arabidopsis - ProteomicsDB",114,32188942,"MaxQuant score",84.1500000,1.0000000,,,,0.00071050401311368,
KVSKVEVGTR,ac,K,224,true,"Quantitative Acetylproteomics",101,29440448,,,,,,,,
