Peptide,PTM,ModifiedAA,ModifiedPosition,PeptideUniqueToGene,ExperimentDesc,ExpID,PubmedID,ScoreType,IdentScore,LocProb,Log2FChange,PQ-val,QuantSig,PEP,MassErrorPPM
SRYQSHSFDDGE,nt,S,2,true,"Arg/N-end rule seed, prt6 vs. Wt",99,29168982,"MASCOT Score",36.0400000,,,,,0.00028670000028796,-3.9008021
SRYQSHSFDDGE,nta,S,2,true,"Arg/N-end rule seed, prt6 vs. Wt",99,29168982,"MASCOT Score",36.0400000,,,,,0.00028670000028796,-3.9008021
SRYQSHSFDDGE,nta,S,2,true,"Arabidopsis translation initiation landscape - NTA",167a,35069635,,,,,,,,
SRYQSHSFDDGEINPFANPTSVPAATSK,ph,S,2,true,"Tissue atlas Arabidopsis - ProteomicsDB",114,32188942,"MaxQuant score",89.1860000,0.7591580,,,,4.9536000826825E-16,
YQSHSFDDGEINPFANPTSVPAATSK,ph,S,8,true,"Tissue atlas Arabidopsis - ProteomicsDB",114,32188942,"MaxQuant score",183.8000000,0.8373520,,,,0,
LSPLPPEPYDR,ph,S,31,true,"atm and atr DNA damage response",88,25561503,"MASCOT Score",40.0000000,1.0000000,,,,,-0.6400000
LSPLPPEPYDR,ph,S,31,true,"Tissue atlas Arabidopsis - ProteomicsDB",114,32188942,"MaxQuant score",140.3900000,1.0000000,,,,0,
GATMDIPLDSGK,ph,T,43,true,"Tissue atlas Arabidopsis - ProteomicsDB",114,32188942,"MaxQuant score",133.1500000,1.0000000,,,,8.4532002802007E-5,
GATMDIPLDSGKDLK,ph,S,50,true,"Tissue atlas Arabidopsis - ProteomicsDB",114,32188942,"MaxQuant score",155.8800000,1.0000000,,,,6.7218700224025E-12,
REQEIKR,me1,K,76,true,"Arabidopsis protein methylome",123,31809900,"MaxQuant Score",134.4800000,1.0000000,,,,2.9177800906134E-19,-0.2079900
