Peptide,PTM,ModifiedAA,ModifiedPosition,PeptideUniqueToGene,ExperimentDesc,ExpID,PubmedID,ScoreType,IdentScore,LocProb,Log2FChange,PQ-val,QuantSig,PEP,MassErrorPPM
NADDIYSEFFGVSSPSGPR,ph,S,40,true,"srk2dei ABA signaling phopshoproteomics",83,23572148,"MASCOT Score",64.0000000,,,,,,-0.0018000
NADDIYSEFFGVSSPSGPR,ph,S,40,true,"Lateral root-induction - NAA vs control",106,23328941,"MASCOT Score",27.0000000,,,,,,
NADDIYSEFFGVSSPSGPR,ph,S,41,true,"srk2dei ABA signaling phopshoproteomics",83,23572148,"MASCOT Score",85.0000000,,,,,,0.0005000
NADDIYSEFFGVSSPSGPR,ph,S,41,true,"SnRK2 protein kinase substrates",85,23776212,XCorr,3.3652234,0.9980000,,,,1.7479299257994E-11,
NADDIYSEFFGVSSPSGPR,ph,S,41,true,"TOR Kinase and ABA Receptor",100,29290610,XCorr,5.9669452,0.9322000,,,,6.8899996819027E-11,
NADDIYSEFFGVSSPSGPR,ph,S,41,true,"Lateral root-induction - NAA vs control",106,23328941,"MASCOT Score",80.0000000,,,,,,
NADDIYSEFFGVSSPSGPR,ph,S,41,true,"Phospho cell culture sucrose/TOR",109,30833711,,,0.7703080,,,,,
NADDIYSEFFGVSSPSGPR,ph,S,41,true,"Col-0 callus - FC Col-0 vs. Col-0 Xray",111a,31410901,,87.6100000,,0.1958970,0.0000000,NO,,1.0755806
NADDIYSEFFGVSSPSGPR,ph,S,41,true,"Col-0 X-ray callus - FC Col-0 vs. Col-0 Xray",111b,31410901,,87.6100000,,0.1958970,0.0000000,NO,,1.0755806
NADDIYSEFFGVSSPSGPR,ph,S,41,true,"atm-3 X-ray callus - FC atm vs. atm Xray",111d,31410901,,87.6100000,,,0.0000000,NO,,1.0755806
DKDDISAEYFGVPSPSGSGSSGGR,ph,S,79,true,"Phosphoproteome iron-deficient Arabidopsis roots",41,22438062,"MASCOT Score",37.3900000,,,,,,
DKDDISAEYFGVPSPSGSGSSGGR,ph,S,79,true,"PAMP-triggered phosphorylation",48,24601666,"MASCOT Score",24.4200000,,,,,,
DKDDISAEYFGVPSPSGSGSSGGR,ph,S,79,true,"srk2dei ABA signaling phopshoproteomics",83,23572148,"MASCOT Score",60.0000000,,,,,,0.0003000
DKDDISAEYFGVPSPSGSGSSGGR,ph,S,79,true,"Col-0 callus - FC Col-0 vs. Col-0 Xray",111a,31410901,,46.7200000,,0.6386340,0.0000000,NO,,0.9538393
DKDDISAEYFGVPSPSGSGSSGGR,ph,S,79,true,"Col-0 X-ray callus - FC Col-0 vs. Col-0 Xray",111b,31410901,,46.7200000,,0.6386340,0.0000000,NO,,0.9538393
DKDDISAEYFGVPSPSGSGSSGGR,ph,S,79,true,"atm callus - FC atm vs. atm Xray",111c,31410901,,46.7200000,,0.1044247,0.0000000,NO,,0.9538393
DKDDISAEYFGVPSPSGSGSSGGR,ph,S,79,true,"atm-3 X-ray callus - FC atm vs. atm Xray",111d,31410901,,46.7200000,,0.1044247,0.0000000,NO,,0.9538393
DKDDISAEYFGVPSPSGSGSSGGR,ph,S,79,true,"Tissue atlas Arabidopsis - ProteomicsDB",114,32188942,"MaxQuant score",251.5200000,0.9975330,,,,0,
LPCSLEDLYK,so,C,116,false,"S-sulfenylation site detection using YAP1C",110,32714340,,,,,,,,
