Peptide,PTM,ModifiedAA,ModifiedPosition,PeptideUniqueToGene,ExperimentDesc,ExpID,PubmedID,ScoreType,IdentScore,LocProb,Log2FChange,PQ-val,QuantSig,PEP,MassErrorPPM
LNIHEYQGAELMGKYGVN,nt,L,27,true,"HUNTER N-terminome: legumain, GluC and trypsin",119,31951383,"MaxQuant score",120.3100000,,,,,,
LNIHEYQGAELMGKY,nt,L,27,true,"Arg/N-end rule pathway Roots",80,25728785,"MASCOT Score",67.7600000,,,,,2.2149999949761E-6,
LNIHEYQGAELMGKY,nt,L,27,true,"Arg/N-end rule seed, prt6 vs. Wt",99,29168982,"MASCOT Score",27.7800000,,-0.1890786,0.5635941,NO,0.023539999499917,-1.7425116
LNIHEYQGAELMGKY,nt,L,27,true,"Arabidopsis translation initiation landscape - NT",167b,35069635,,,,,,,,
LNIHEYQGAELMGK,nt,L,27,true,"Arg/N-end rule pathway Roots",80,25728785,"MASCOT Score",20.9400000,,,,,0.010769999586046,
GVAASSLEEVKK,ph,S,53,true,"Tissue atlas Arabidopsis - ProteomicsDB",114,32188942,"MaxQuant score",113.9900000,0.9419120,,,,3.8767899241066E-5,
ESELVVKSQILAGGR,nt,E,68,true,"Mitochondrial intermediate peptidases - icp55 / WT",131a,25732537,,89.7700000,,-0.1138310,,,,
ESELVVKSQILAGGR,nt,E,68,true,"Mitochondrial intermediate peptidases - oct1-1 / WT",131b,25732537,,93.2100000,,0.3634972,,,,
ESELVVKSQILAGGR,nt,E,68,true,"Mitochondrial intermediate peptidases - oct1-2 / WT",131c,25732537,,99.9200000,,0.4298297,,,,
GLGTFKSGLK,ac,K,88,true,"Quantitative Acetylproteomics",101,29440448,,,,,,,,
SGLKGGVHIVKRDE,nt,S,89,true,"Arabidopsis translation initiation landscape - NT",167b,35069635,,,,,,,,
MLGQVLVTK,mox,M,110,true,"cat2 Methionine oxidation - 1h stress",62a,25693801,"MASCOT Score",48.0000000,,0.2569864,,NO,,
MLGQVLVTK,mox,M,110,true,"cat2 Methionine oxidation - 3h stress",62b,25693801,"MASCOT Score",40.0000000,,0.0163015,,NO,,
VYLCEK,sno,C,133,true,"hot5-4 / wildtype, FAT-switch S-nitrosoproteome",169,37277371,,,,0.3476978,0.0069314,NO,,
VYLCEK,so,C,133,true,"S-sulfenylation site detection using YAP1C",110,32714340,,,,,,,,
KSAGPLIIACK,ox,C,160,true,"Redox kickstart of mitochondria",112,31871212,,,,-1.3120890,0.0046327,YES,,
SAGPLIIACK,ox,C,160,true,"OxiTRAQ Arabidopsis - 5 mM H2O2 versus control",47,24376095,,,,0.4197841,0.0218315,NO,,
SAGPLIIACK,ox,C,160,true,"Redox kickstart of mitochondria",112,31871212,,,,-1.1060187,0.0034183,YES,,
SAGPLIIACK,sno,C,160,true,"hot5-4 / wildtype, FAT-switch S-nitrosoproteome",169,37277371,,,,-0.1010754,0.3150361,NO,,
SAGPLIIACK,so,C,160,true,"Arabidopsis S-sulfenylation chemoproteomics",108,31578252,"pFind PSM Score",0.0033409,,0.9476600,,,,-0.9822502
SAGPLIIACK,so,C,160,true,"S-sulfenylation site detection using YAP1C",110,32714340,,,,,,,,
DSIEQVKK,ac,K,216,true,"Quantitative Acetylproteomics",101,29440448,,,,,,,,
TDCTMLEINPLAETSTNQLVAADAK,ox,C,227,true,"Redox kickstart of mitochondria",112,31871212,,,,-1.7210427,0.0067734,YES,,
KTDCTMLEINPLAETSTNQLVAADAK,sno,C,227,true,"Site-specific nitrosomeproteomic id - gsnor1-3",90a,25699590,XCorr,4.9774742,,,,,4.6630002081827E-9,-4.1702135
KTDCTMLEINPLAETSTNQLVAADAK,sno,C,227,true,"Site-specific nitrosomeproteomic id - gsnor1-3",90b,25699590,XCorr,2.8800000,,,,,0.00011210000229767,-4.7400000
KTDCTMLEINPLAETSTNQLVAADAK,so,C,227,true,"Arabidopsis S-sulfenylation chemoproteomics",108,31578252,"pFind PSM Score",0.0000014,,0.9680100,,,,-0.7307155
QLVAADAKLNFDDNAAFRQKE,nt,Q,242,true,"Arabidopsis translation initiation landscape - NT",167b,35069635,,,,,,,,
CDVIASGIVNAAK,acy,C,359,true,"Arabidopsis S-acylation atlas - Hypocotyl",163b,35681017,,,,,,,,
CDVIASGIVNAAK,acy,C,359,true,"Arabidopsis S-acylation atlas - Leaf",163c,35681017,,,,,,,,
CDVIASGIVNAAK,cn,C,359,true,"Cellular regulation by S-cyanylation",115,30377236,,,,,,,,
CDVIASGIVNAAK,ox,C,359,true,"Redox kickstart of mitochondria",112,31871212,,,,-2.0987771,0.0189369,YES,,
CDVIASGIVNAAK,sno,C,359,true,"hot5-4 / wildtype, FAT-switch S-nitrosoproteome",169,37277371,,,,,,,,
CDVIASGIVNAAK,so,C,359,true,"S-sulfenylation site detection using YAP1C",110,32714340,,,,,,,,
DVIASGIVNAAKE,nt,D,360,true,"Arg/N-end rule seed, prt6 vs. Wt",99,29168982,"MASCOT Score",51.2700000,,-0.3691189,0.3853691,NO,5.8689997786132E-6,-0.2597879
LEGTNVEQGKR,ac,K,392,true,"Quantitative Acetylproteomics",101,29440448,,,,,,,,
LEGTNVEQGKR,ub,K,392,true,"Arabidopsis ubiquitination COFRADIC",40,26744219,"MaxQuant Score",126.1900000,1.0000000,,,,1.3530000231299E-8,0.3480000
