Peptide,PTM,ModifiedAA,ModifiedPosition,PeptideUniqueToGene,ExperimentDesc,ExpID,PubmedID,ScoreType,IdentScore,LocProb,Log2FChange,PQ-val,QuantSig,PEP,MassErrorPPM
MEDELEGLRAHFPVSF,nta,M,1,true,"Arabidopsis translation initiation landscape - NTA",167a,35069635,,,,,,,,
MEDELEGLR,nta,M,1,true,"Arg/N-end rule seed, prt6 vs. Wt",99,29168982,"MASCOT Score",55.0600000,,,,,0.047609999775887,-0.6959745
AHFPVSFGK,ph,S,15,true,"atm and atr DNA damage response",88,25561503,"MASCOT Score",25.0000000,1.0000000,,,,,-3.2800000
GLGNINDSDDEGDMIGPPPPPPAAR,ph,S,127,true,"STN8 phosphoproteome",38,21768351,"MASCOT Score",93.4200000,,,,,,
GLGNINDSDDEGDMIGPPPPPPAAR,ph,S,127,true,"Large-scale phosphorylation discovery",44,23111157,XCorr,5.0400000,,,,,,
GLGNINDSDDEGDMIGPPPPPPAAR,ph,S,127,true,"Chloroplast kinase substrates",60,19376835,"MASCOT Score",84.7400000,,,,,,-0.7949260
GLGNINDSDDEGDMIGPPPPPPAAR,ph,S,127,true,"srk2dei ABA signaling phopshoproteomics",83,23572148,"MASCOT Score",28.0000000,,,,,,0.0021000
GLGNINDSDDEGDMIGPPPPPPAAR,ph,S,127,true,"LAXIC - ABA stress",84a,23660473,XCorr,4.2300000,1.0000000,,,,1.6400000504291E-6,
GLGNINDSDDEGDMIGPPPPPPAAR,ph,S,127,true,"SnRK2 protein kinase substrates",85,23776212,XCorr,3.6038282,1.0000000,,,,1.5413099390571E-5,
GLGNINDSDDEGDMIGPPPPPPAAR,ph,S,127,true,"TOR Kinase and ABA Receptor",100,29290610,XCorr,2.5899458,1.0000000,,,,0.0016850000247359,
GLGNINDSDDEGDMIGPPPPPPAAR,ph,S,127,true,"Lateral root-induction - NAA vs control",106,23328941,"MASCOT Score",38.0000000,,,,,,
GLGNINDSDDEGDMIGPPPPPPAAR,ph,S,127,true,"Tissue atlas Arabidopsis - ProteomicsDB",114,32188942,"MaxQuant score",501.5400000,1.0000000,,,,0,
DSDEDSDDDDDNDNEENR,ph,S,146,true,"atm and atr DNA damage response",88,25561503,"MASCOT Score",54.0000000,1.0000000,,,,,-1.7300000
DSDEDSDDDDDNDNEENRYQIPLSNEIQLK,ph,S,150,true,"SnRK2 protein kinase substrates",85,23776212,XCorr,5.9329400,0.7970000,,,,3.6731400798566E-13,
DSDEDSDDDDDNDNEENR,ph,S,150,true,"atm and atr DNA damage response",88,25561503,"MASCOT Score",63.0000000,1.0000000,,,,,-0.2500000
FIAPAYSQTQPK,ph,S,626,true,"Tissue atlas Arabidopsis - ProteomicsDB",114,32188942,"MaxQuant score",96.5330000,0.9406130,,,,0.00047065399121493,
TIFAKSDDEEEEGDTKK,ph,S,637,true,"Arabidopsis root NAA phosphoproteome",18a,27643528,"MaxQuant Score",53.6250000,0.9970000,,,,3.2799998734845E-5,0.0590000
TIFAKSDDEEEEGDTKK,ph,S,637,true,"STN8 phosphoproteome",38,21768351,"MASCOT Score",54.1300000,,,,,,0.2969040
TIFAKSDDEEEEGDTKK,ph,S,637,true,"Large-scale phosphorylation discovery",44,23111157,XCorr,4.9280000,,,,,,
TIFAKSDDEEEEGDTKK,ph,S,637,true,"Phosphoproteome ethylene-regulated time response",46,24043427,"MASCOT Score",49.8200000,,,,,,-16.4049000
TIFAKSDDEEEEGDTKK,ph,S,637,true,"Tyrosine phosphorylation in Arabidopsis",59,18463617,"MASCOT Score",65.0000000,,,,,,-0.2969046
TIFAKSDDEEEEGDTKK,ph,S,637,true,"Chloroplast kinase substrates",60,19376835,"MASCOT Score",41.9800000,,,,,,-0.8908230
TIFAKSDDEEEEGDTKK,ph,S,637,true,"Conserved plant phosphoproteome - Arabidopsis",61a,20466843,"MASCOT Score",91.0000000,1.0000000,,,,,
TIFAKSDDEEEEGDTKK,ph,S,637,true,"srk2dei ABA signaling phopshoproteomics",83,23572148,"MASCOT Score",66.0000000,,,,,,-0.0010000
TIFAKSDDEEEEGDTKK,ph,S,637,true,"LAXIC - ABA stress",84a,23660473,XCorr,3.0100000,0.8840000,,,,6.4099998553502E-7,
TIFAKSDDEEEEGDTKK,ph,S,637,true,"LAXIC - mannitol vs control",84b,23660473,XCorr,3.0400000,0.8800000,,,,1.9099999359895E-9,
TIFAKSDDEEEEGDTKK,ph,S,637,true,"SnRK2 protein kinase substrates",85,23776212,XCorr,4.1083827,1.0000000,,,,0.018919300287962,
TIFAKSDDEEEEGDTKK,ph,S,637,true,"Phospho cell culture sucrose/TOR",109,30833711,,,1.0000000,,,,,
TIFAKSDDEEEEGDTKK,ph,S,637,true,"Tissue atlas Arabidopsis - ProteomicsDB",114,32188942,"MaxQuant score",355.4500000,1.0000000,,,,0,
TIFAKSDDEEEEGDTKK,ph,S,637,true,"Touch-induced phosphorylation: 40s touch vs untouc",136,30291188,"MASCOT score",92.5600000,,-0.0012028,0.9922014,NO,,1.8991358
TIFAKSDDEEEEGDTK,ph,S,637,true,"Tyrosine phosphorylation in Arabidopsis",59,18463617,"MASCOT Score",50.0000000,,,,,,-1.4793262
TIFAKSDDEEEEGDTK,ph,S,637,true,"Conserved plant phosphoproteome - Arabidopsis",61a,20466843,"MASCOT Score",22.0000000,1.0000000,,,,,
TIFAKSDDEEEEGDTK,ph,S,637,true,"srk2dei ABA signaling phopshoproteomics",83,23572148,"MASCOT Score",31.0000000,,,,,,-0.0013000
TIFAKSDDEEEEGDTK,ph,S,637,true,"TOR Kinase and ABA Receptor",100,29290610,XCorr,2.3893967,0.9998000,,,,0.016759999096394,
