Peptide,PTM,ModifiedAA,ModifiedPosition,PeptideUniqueToGene,ExperimentDesc,ExpID,PubmedID,ScoreType,IdentScore,LocProb,Log2FChange,PQ-val,QuantSig,PEP,MassErrorPPM
EGMLLNAEELTTSCEEK,ph,S,67,true,"Tissue atlas Arabidopsis - ProteomicsDB",114,32188942,"MaxQuant score",179.8100000,0.8167150,,,,1.1998399861103E-29,
SEAQIMVER,ph,S,84,true,"Tissue atlas Arabidopsis - ProteomicsDB",114,32188942,"MaxQuant score",143.4000000,1.0000000,,,,2.27650995277E-10,
DGVRSPVTSK,ph,S,97,true,"atm and atr DNA damage response",88,25561503,"MASCOT Score",20.0000000,1.0000000,,,,,-1.8900000
DGVRSPVTSK,ph,S,97,true,"Tissue atlas Arabidopsis - ProteomicsDB",114,32188942,"MaxQuant score",128.5700000,0.9999920,,,,9.4104798336048E-5,
DNEESASGSPERDDITLSK,ph,S,147,true,"Tissue atlas Arabidopsis - ProteomicsDB",114,32188942,"MaxQuant score",273.5600000,0.9999840,,,,0,
DNEESASGSPERDDITLSK,ph,S,151,true,"SnRK2 protein kinase substrates",85,23776212,XCorr,3.0027034,0.9200000,,,,0.01964920014143,
DNEESASGSPERDDITLSK,ph,S,151,true,"Tissue atlas Arabidopsis - ProteomicsDB",114,32188942,"MaxQuant score",352.4700000,0.9996320,,,,0,
DDITLSK,ph,S,160,true,"Tissue atlas Arabidopsis - ProteomicsDB",114,32188942,"MaxQuant score",64.7490000,0.9845680,,,,0.00013095399481244,
ELDTQVVNGHLK,ph,T,168,true,"Tissue atlas Arabidopsis - ProteomicsDB",114,32188942,"MaxQuant score",138.4200000,1.0000000,,,,3.8730999222025E-5,
VGGTEEDTAACDR,ph,T,184,true,"Tissue atlas Arabidopsis - ProteomicsDB",114,32188942,"MaxQuant score",172.8200000,1.0000000,,,,8.565879871191E-15,
LLEKNSEDNELQSPR,ph,S,203,true,"Tissue atlas Arabidopsis - ProteomicsDB",114,32188942,"MaxQuant score",133.9200000,1.0000000,,,,1.1674500228764E-6,
NSEDNELQSPR,ph,S,210,true,"Pollen phosphoproteome Arabidopsis",43,22631563,"MASCOT Score",60.5800000,,,,,,-1.0626700
NSEDNELQSPR,ph,S,210,true,"Large-scale phosphorylation discovery",44,23111157,XCorr,3.0130000,,,,,,
NSEDNELQSPR,ph,S,210,true,"SnRK2 protein kinase substrates",85,23776212,XCorr,2.2023573,1.0000000,,,,0.015654599294066,
NSEDNELQSPR,ph,S,210,true,"atm and atr DNA damage response",88,25561503,"MASCOT Score",51.0000000,1.0000000,,,,,0.0700000
NSEDNELQSPR,ph,S,210,true,"Lateral root-induction - NAA vs control",106,23328941,"MASCOT Score",34.0000000,,,,,,
NSEDNELQSPR,ph,S,210,true,"Tissue atlas Arabidopsis - ProteomicsDB",114,32188942,"MaxQuant score",301.6200000,1.0000000,,,,0,
EVIGEQDSSPCTADAVK,ph,S,237,true,"Tissue atlas Arabidopsis - ProteomicsDB",114,32188942,"MaxQuant score",334.4300000,0.9996450,,,,0,
EVIGEQDSSPCTADAVK,ph,T,240,true,"Tissue atlas Arabidopsis - ProteomicsDB",114,32188942,"MaxQuant score",237.8600000,0.9999970,,,,0,
VAGETYQNVYFNGPVLPQSPTQGHR,ph,S,264,true,"Tissue atlas Arabidopsis - ProteomicsDB",114,32188942,"MaxQuant score",215.0500000,0.9253050,,,,0,
RTQSEIGTPGHR,ph,T,272,true,"TOR Kinase and ABA Receptor",100,29290610,XCorr,3.4236646,0.9962000,,,,0.00017879999359138,
TQSEIGTPGHR,ph,S,274,true,"Tissue atlas Arabidopsis - ProteomicsDB",114,32188942,"MaxQuant score",144.5100000,0.9999740,,,,4.2542101397203E-8,
TQSEIGTPGHR,ph,T,278,true,"Tissue atlas Arabidopsis - ProteomicsDB",114,32188942,"MaxQuant score",111.3300000,1.0000000,,,,0.0033455900847912,
RTNSFQR,ph,S,286,true,"Tissue atlas Arabidopsis - ProteomicsDB",114,32188942,"MaxQuant score",88.9480000,0.9718160,,,,0.015913799405098,
RQWYQLHSSK,ph,S,329,true,"TOR Kinase and ABA Receptor",100,29290610,XCorr,2.1128876,0.9914000,,,,0.010870000347495,
QWYQLHSSK,ph,S,329,true,"Tissue atlas Arabidopsis - ProteomicsDB",114,32188942,"MaxQuant score",204.0000000,0.9997910,,,,8.4608400565558E-16,
VFHCYDENSPEVFENHLDTPER,ph,T,655,true,"Tissue atlas Arabidopsis - ProteomicsDB",114,32188942,"MaxQuant score",217.0700000,1.0000000,,,,0,
TSQSYDNGHTSPEVTCSDPR,ph,T,668,true,"atm and atr DNA damage response",88,25561503,"MASCOT Score",33.0000000,0.9990000,,,,,-0.4700000
TSQSYDNGHTSPEVTCSDPR,ph,S,669,true,"Tissue atlas Arabidopsis - ProteomicsDB",114,32188942,"MaxQuant score",135.6100000,0.9865130,,,,2.5107700303435E-21,
NESCESVFSSAR,ph,S,687,true,"Tissue atlas Arabidopsis - ProteomicsDB",114,32188942,"MaxQuant score",192.6500000,1.0000000,,,,2.523769956346E-24,
NESCESVFSSAR,ph,S,690,true,"Tissue atlas Arabidopsis - ProteomicsDB",114,32188942,"MaxQuant score",77.3240000,0.9917830,,,,0.0016016799490899,
NESCESVFSSAR,ph,S,693,true,"Tissue atlas Arabidopsis - ProteomicsDB",114,32188942,"MaxQuant score",188.0900000,0.8287880,,,,1.8199700538813E-20,
NESCESVFSSAR,ph,S,694,true,"Tissue atlas Arabidopsis - ProteomicsDB",114,32188942,"MaxQuant score",211.4500000,0.9052090,,,,1.8737699686571E-31,
