Peptide,PTM,ModifiedAA,ModifiedPosition,PeptideUniqueToGene,ExperimentDesc,ExpID,PubmedID,ScoreType,IdentScore,LocProb,Log2FChange,PQ-val,QuantSig,PEP,MassErrorPPM
SSVKAMSSSSSSSGSTLEE,nt,S,58,true,"HUNTER N-terminome: legumain, GluC and trypsin",119,31951383,"MaxQuant score",112.7200000,,,,,,
AMSSSSSSSGSTLE,nt,A,62,true,"Arg/N-end rule seed, prt6 vs. Wt",99,29168982,"MASCOT Score",83.9900000,,-0.0424694,0.9184929,NO,5.8089998589139E-8,-2.6552378
AMSSSSSSSGSTLEETVK,nta,A,62,true,"Characterization plant N-terminal acetylation",6,22223895,"MASCOT Score",85.9800000,,,,,,
SSSSSSSGSTLEETVKTTVAEN,nt,S,64,true,"HUNTER N-terminome: legumain, GluC and trypsin",119,31951383,"MaxQuant score",184.7600000,,,,,,
SSSSSSSGSTLEETVK,nt,S,64,true,"Stromal N-terminome",96,26371235,"MASCOT Score",56.6700000,,,,,,
SSSSSSSGSTLEE,nt,S,64,true,"N-terminal ChaFRADIC",92,26010716,"MASCOT Score",61.1600000,,,,,9.2330001280061E-6,
SSSSSSSGSTLEE,nt,S,64,true,"Arg/N-end rule seed, prt6 vs. Wt",99,29168982,"MASCOT Score",48.3700000,,-0.2696107,0.2294705,NO,2.2270000044955E-5,-1.6367732
SSSSSSSGSTLE,nt,S,64,true,"Arg/N-end rule seed, prt6 vs. Wt",99,29168982,"MASCOT Score",40.8400000,,-0.1090194,0.2652721,NO,0.00047599998652004,-1.9773081
SSSSSSSGSTLEETVK,nta,S,64,true,"Characterization plant N-terminal acetylation",6,22223895,"MASCOT Score",75.6000000,,,,,,
SSSSSSSGSTLEETVK,nta,S,64,true,"Stromal N-terminome",96,26371235,"MASCOT Score",56.6700000,,,,,,
SSSSSSGSTLEE,nt,S,65,true,"N-terminal ChaFRADIC",92,26010716,"MASCOT Score",65.0200000,,,,,2.7870000849362E-6,
SSSSSSGSTLEE,nt,S,65,true,"Arg/N-end rule seed, prt6 vs. Wt",99,29168982,"MASCOT Score",56.5500000,,-0.2122792,0.2266169,NO,0.0010189999593422,-1.6171596
SSSSSGSTLEE,nt,S,66,true,"N-terminal ChaFRADIC",92,26010716,"MASCOT Score",56.6300000,,,,,0.00026400000206195,
SSSGSTLEE,nt,S,68,true,"N-terminal ChaFRADIC",92,26010716,"MASCOT Score",36.2200000,,,,,0.012480000033975,
TWCSYSSQVK,ox,C,95,true,"OxiTRAQ Arabidopsis - 5 mM H2O2 versus control",47,24376095,,,,-0.1762152,0.4342857,NO,,
TWCSYSSQVK,ph,S,96,true,"Tissue atlas Arabidopsis - ProteomicsDB",114,32188942,"MaxQuant score",101.3500000,0.9591710,,,,0.0003952810075134,
HIGGCSDTLQLHNK,sno,C,153,true,"Site-specific nitrosomeproteomic id - gsnor1-3",90a,25699590,XCorr,3.5721569,,,,,6.3029998273123E-5,-7.4787015
HIGGCSDTLQLHNK,sno,C,153,true,"Site-specific nitrosomeproteomic id - gsnor1-3",90b,25699590,XCorr,3.8100000,,,,,0.03719000145793,-6.1800000
HIGGCSDTLQLHNK,so,C,153,true,"S-sulfenylation site detection using YAP1C",110,32714340,,,,,,,,
