Peptide,PTM,ModifiedAA,ModifiedPosition,PeptideUniqueToGene,ExperimentDesc,ExpID,PubmedID,ScoreType,IdentScore,LocProb,Log2FChange,PQ-val,QuantSig,PEP,MassErrorPPM
STTIVSFLPMRSFGSR,ph,S,38,true,"TOR Kinase and ABA Receptor",100,29290610,XCorr,2.1643658,0.8551000,,,,0.021630000323057,
AAEDTPPATASSDSSSTTAAAAPAKVPA,nt,A,47,true,"Arg/N-end rule seed, prt6 vs. Wt",99,29168982,"MASCOT Score",49.6000000,,-0.2059555,0.4203124,NO,5.7969999033958E-5,-0.2943530
AAEDTPPATASSDSSSTTAAAAPA,nt,A,47,true,"Arg/N-end rule seed, prt6 vs. Wt",99,29168982,"MASCOT Score",37.1900000,,-0.4346150,0.6102427,NO,0.10629999637604,-1.3674599
AAEDTPPATAS,nt,A,47,true,"N-terminal ChaFRADIC",92,26010716,"MASCOT Score",74.1500000,,,,,1.0320000409791E-9,
AAEDTPPATA,nt,A,47,true,"N-terminal ChaFRADIC",92,26010716,"MASCOT Score",76.4100000,,,,,1.4879999525874E-6,
AAEDTPPATA,nt,A,47,true,"Arg/N-end rule seed, prt6 vs. Wt",99,29168982,"MASCOT Score",39.2900000,,-0.1821545,0.8379050,NO,0.10499999672174,-0.2477119
AEDTPPATAS,nt,A,48,true,"N-terminal ChaFRADIC",92,26010716,"MASCOT Score",63.2400000,,,,,7.8400000802503E-7,
AEDTPPATA,nt,A,48,true,"N-terminal ChaFRADIC",92,26010716,"MASCOT Score",64.9000000,,,,,1.0160000556425E-6,
EDTPPATAS,nt,E,49,true,"N-terminal ChaFRADIC",92,26010716,"MASCOT Score",29.2500000,,,,,0.0072800000198185,
AAEDTPPATASSDSSSTTAAAAPAK,ph,T,55,true,"Tissue atlas Arabidopsis - ProteomicsDB",114,32188942,"MaxQuant score",115.8800000,0.9879940,,,,3.0370400671185E-21,
AAEDTPPATASSDSSSTTAAAAPAK,ph,S,57,true,"Tissue atlas Arabidopsis - ProteomicsDB",114,32188942,"MaxQuant score",187.8600000,0.8304850,,,,0,
AAEDTPPATASSDSSSTTAAAAPAK,ph,S,58,true,"TOR Kinase and ABA Receptor",100,29290610,XCorr,5.0578790,0.7513000,,,,2.0890000087093E-5,
AAEDTPPATASSDSSSTTAAAAPAK,ph,S,58,true,"Tissue atlas Arabidopsis - ProteomicsDB",114,32188942,"MaxQuant score",244.9500000,0.7540190,,,,0,
VPAAKAKPPPIGPK,cr,K,76,true,"Open search Plant PTM Viewer 2.0 - Crotonylation",164c,TBA,,,,,,,,
AKPPPIGPK,ac,K,78,true,"Quantitative Acetylproteomics",101,29440448,,,,,,,,
AKPPPIGPKR,ac,K,85,true,"Quantitative Acetylproteomics",101,29440448,,,,,,,,
GSKVKILR,ub,K,91,false,"Arabidopsis ubiquitination COFRADIC",40,26744219,"MaxQuant Score",51.3460000,0.9990000,,,,0.027000000700355,0.3600000
ESYWYKNVGSVVAVDQDPK,ac,K,101,true,"Histone deacetylases - hda14 vs WT (thylakoids)",98d,29061669,"MaxQuant Score",70.8000000,1.0000000,-0.0440000,0.9954054,NO,8.5700001761779E-8,
NVGSVVAVDQDPK,ph,S,105,false,"Large-scale phosphorylation discovery",44,23111157,XCorr,4.3720000,,,,,,
NVGSVVAVDQDPK,ph,S,105,false,"atm and atr DNA damage response",88,25561503,"MASCOT Score",62.0000000,1.0000000,,,,,-0.3500000
NVGSVVAVDQDPK,ph,S,105,false,"TOR Kinase and ABA Receptor",100,29290610,XCorr,4.3059573,1.0000000,,,,6.2409999372903E-5,
NVGSVVAVDQDPK,ph,S,105,false,"Tissue atlas Arabidopsis - ProteomicsDB",114,32188942,"MaxQuant score",125.3300000,1.0000000,,,,4.455149792193E-6,
NVGSVVAVDQDPK,ph,S,105,false,"Touch-induced phosphorylation: 40s touch vs untouc",136,30291188,"MASCOT score",74.5700000,,0.1310489,0.6170624,NO,,6.2030089
NVGSVVAVDQDPKTRYPVVVR,ac,K,114,false,"Quantitative Acetylproteomics",101,29440448,,,,,,,,
NVGSVVAVDQDPKTR,ac,K,114,false,"Histone deacetylases - apicidin vs control",98a,29061669,"MaxQuant Score",133.9000000,1.0000000,0.9600000,0.4285485,NO,4.9000000495385E-15,
NVGSVVAVDQDPKTR,ac,K,114,false,"Histone deacetylases substrates - TSA vs control",98b,29061669,"MaxQuant Score",133.9000000,1.0000000,0.0730000,0.9977001,NO,4.9000000495385E-15,
NVGSVVAVDQDPKTR,ac,K,114,false,"Histone deacetylases- hda14 vs WT (low light)",98c,29061669,"MaxQuant Score",212.5000000,1.0000000,1.1150000,0.4539416,NO,3.0000001167616E-16,
NVGSVVAVDQDPKTR,ac,K,114,false,"Histone deacetylases - hda14 vs WT (thylakoids)",98d,29061669,"MaxQuant Score",161.2000000,1.0000000,0.1370000,0.9817479,NO,2.8600001289592E-16,
NVGSVVAVDQDPKTR,ac,K,114,false,"Histone deacetylases substrates - hda14 vs WT",98e,29061669,"MaxQuant Score",176.5000000,1.0000000,0.2830000,0.5000345,NO,0,
NVGSVVAVDQDPKTR,ac,K,114,false,"Quantitative Acetylproteomics",101,29440448,,,,,,,,
FAKVNYANISTNNYALDEVEEVK,ac,K,125,true,"Histone deacetylases - hda14 vs WT (thylakoids)",98d,29061669,"MaxQuant Score",137.6000000,1.0000000,0.1170000,0.9749896,NO,1.7000000053908E-29,
FAKVNYANISTNNYALDEVEEVK,ac,K,125,true,"Quantitative Acetylproteomics",101,29440448,,,,,,,,
VNYANISTNNYALDEVEEVK,ph,S,132,true,"Tissue atlas Arabidopsis - ProteomicsDB",114,32188942,"MaxQuant score",153.3600000,0.8189780,,,,4.0366098801821E-25,
