Peptide,PTM,ModifiedAA,ModifiedPosition,PeptideUniqueToGene,ExperimentDesc,ExpID,PubmedID,ScoreType,IdentScore,LocProb,Log2FChange,PQ-val,QuantSig,PEP,MassErrorPPM
NCCHVSFASTLK,acy,C,5,true,"Arabidopsis S-acylation atlas - Seedling",163d,35681017,,,,,,,,
NCCHVSFASTLK,acy,C,5,true,"Arabidopsis S-acylation atlas - Silique",163e,35681017,,,,,,,,
NCCHVSFASTLK,acy,C,5,true,"Arabidopsis S-acylation atlas - Stem",163f,35681017,,,,,,,,
NCCHVSFASTLK,acy,C,6,true,"Arabidopsis S-acylation atlas - Seedling",163d,35681017,,,,,,,,
NCCHVSFASTLK,acy,C,6,true,"Arabidopsis S-acylation atlas - Silique",163e,35681017,,,,,,,,
NCCHVSFASTLK,acy,C,6,true,"Arabidopsis S-acylation atlas - Stem",163f,35681017,,,,,,,,
AFIEENIDICK,sno,C,183,false,"hot5-4 / wildtype, FAT-switch S-nitrosoproteome",169,37277371,,,,,,,,
TWDPLLGPQGNQAPAGSSKIENWSSR,ub,K,246,true,"Ubiquitination Membrane Proteins",120,33585938,,,,,,,,
TWDPLLGPQGNQAPAGSSKIENWSSR,ub,K,246,true,"upl3 mutant / wildtype",168,35926874,"MaxQuant score",100.2300000,1.0000000,,,,1.4103000017807E-11,0.2714000
IENWSSR,ph,S,251,true,"Tissue atlas Arabidopsis - ProteomicsDB",114,32188942,"MaxQuant score",119.7500000,0.9444200,,,,0.010727499611676,
IREKYGLNQSPPVNPK,ub,K,257,true,"Ubiquitination Membrane Proteins",120,33585938,,,,,,,,
YGLNQSPPVNPKG,ph,S,263,true,"STN8 phosphoproteome",38,21768351,"MASCOT Score",53.8100000,,,,,,-1.5143700
YGLNQSPPVNPKG,ph,S,263,true,"Chloroplast kinase substrates",60,19376835,"MASCOT Score",42.7400000,,,,,,-1.5143700
YGLNQSPPVNPKG,ph,S,263,true,"Tissue atlas Arabidopsis - ProteomicsDB",114,32188942,"MaxQuant score",285.2800000,1.0000000,,,,0,
YGLNQSPPVNPK,ph,S,263,true,"Large-scale phosphorylation discovery",44,23111157,XCorr,3.2420000,,,,,,
YGLNQSPPVNPK,ph,S,263,true,"atm and atr DNA damage response",88,25561503,"MASCOT Score",33.0000000,0.9610000,,,,,2.1000000
YGLNQSPPVNPK,ph,S,263,true,"TOR Kinase and ABA Receptor",100,29290610,XCorr,3.8133743,1.0000000,,,,0.00038630000199191,
YGLNQSPPVNPKG,ub,K,269,true,"Ubiquitination Membrane Proteins",120,33585938,,,,,,,,
YGLNQSPPVNPKG,ub,K,269,true,"upl3 mutant / wildtype",168,35926874,"MaxQuant score",127.5600000,1.0000000,0.2215678,0.5896400,NO,3.5232899335824E-6,-0.4724400
