Peptide,PTM,ModifiedAA,ModifiedPosition,PeptideUniqueToGene,ExperimentDesc,ExpID,PubmedID,ScoreType,IdentScore,LocProb,Log2FChange,PQ-val,QuantSig,PEP,MassErrorPPM
MEEALEMARA,nta,M,1,true,"N-term acetylation drought responses",5,26184543,,,,,,,,
MEEALEMAR,nta,M,1,true,"Characterization plant N-terminal acetylation",6,22223895,"MASCOT Score",67.9400000,,,,,,
MEEALEMAR,nta,M,1,true,"Arg/N-end rule pathway Roots",80,25728785,"MASCOT Score",56.7200000,,,,,0.00014649999502581,
MEEALEMAR,nta,M,1,true,"Arg/N-end rule seed, prt6 vs. Wt",99,29168982,"MASCOT Score",63.2700000,,,,,0.013989999890327,-0.5501772
MEEALEMAR,nta,M,1,true,"Arabidopsis translation initiation landscape - NTA",167a,35069635,,,,,,,,
SAHHVVNEVK,ph,S,229,true,"Tissue atlas Arabidopsis - ProteomicsDB",114,32188942,"MaxQuant score",69.2290000,1.0000000,,,,0.0066742701455951,
ENSLFGGDADITEKPIEPIKVYSEK,ph,S,259,true,"Tissue atlas Arabidopsis - ProteomicsDB",114,32188942,"MaxQuant score",365.4700000,1.0000000,,,,0,
ENSLFGGDADITEKPIEPIK,ph,S,259,true,"srk2dei ABA signaling phopshoproteomics",83,23572148,"MASCOT Score",25.0000000,,,,,,-0.0009000
ENSLFGGDADITEKPIEPIK,ph,S,259,true,"Phospho cell culture sucrose/TOR",109,30833711,,,1.0000000,,,,,
VEGLVAGGATDYSCFR,sno,C,323,true,"hot5-4 / wildtype, FAT-switch S-nitrosoproteome",169,37277371,,,,-0.0961789,0.3716780,NO,,
CCVADAMSEVR,sno,C,457,true,"hot5-4 / wildtype, FAT-switch S-nitrosoproteome",169,37277371,,,,,,,,
RHASPSVR,ph,S,513,true,"atm and atr DNA damage response",88,25561503,"MASCOT Score",29.0000000,1.0000000,,,,,0.8200000
HASPSVR,ph,S,513,true,"Immuno-dot blot phosphorylation",31,19341826,"MASCOT Score",36.7400000,,,,,,-7.4129600
HASPSVR,ph,S,513,true,"Chloroplast kinase substrates",60,19376835,"MASCOT Score",36.8300000,,,,,,0.0235118
HASPSVR,ph,S,513,true,"SnRK2 protein kinase substrates",85,23776212,XCorr,2.1635468,0.9990000,,,,0.11595299839973,
HASPSVR,ph,S,513,true,"Tissue atlas Arabidopsis - ProteomicsDB",114,32188942,"MaxQuant score",186.5400000,0.9999980,,,,2.371770051468E-6,
ERHSQPSFSQTSAPSNLPGYGTSAIVAMDR,fuc,S,521,true,"SPINDLY O-fucosylation",162,36739885,,,,,,,0.44999998807907,
ERHSQPSFSQTSAPSNLPGYGTSAIVAMDR,fuc,T,539,true,"SPINDLY O-fucosylation",162,36739885,,,,,,,-0.25,
HSQPSFSQTSAPSNLPGYGTSAIVAMDR,fuc,T,539,true,"SPINDLY O-fucosylation",162,36739885,,,,,,,1.6000000238419,
SSNLSSGGSLSSGLLLSQSK,ph,S,552,true,"Tissue atlas Arabidopsis - ProteomicsDB",114,32188942,"MaxQuant score",199.7000000,0.9814970,,,,0,
SSNLSSGGSLSSGLLLSQSK,ph,S,556,true,"Tissue atlas Arabidopsis - ProteomicsDB",114,32188942,"MaxQuant score",152.1300000,0.9909690,,,,1.043660019379E-24,
SSNLSSGGSLSSGLLLSQSK,ph,S,558,true,"Tissue atlas Arabidopsis - ProteomicsDB",114,32188942,"MaxQuant score",181.6100000,0.7964020,,,,2.2701035122062E-43,
DVNKGSER,ph,S,573,true,"atm and atr DNA damage response",88,25561503,"MASCOT Score",34.0000000,1.0000000,,,,,-0.6400000
SLESVLQSSK,ph,S,576,true,"atm and atr DNA damage response",88,25561503,"MASCOT Score",56.0000000,1.0000000,,,,,1.2300000
SLESVLQSSK,ph,S,576,true,"Tissue atlas Arabidopsis - ProteomicsDB",114,32188942,"MaxQuant score",96.3340000,0.9999220,,,,0.00053613202180713,
QKVSAIESMLR,nt,Q,586,true,"Arabidopsis translation initiation landscape - NT",167b,35069635,,,,,,,,
VSAIESMLR,ph,S,593,true,"Tissue atlas Arabidopsis - ProteomicsDB",114,32188942,"MaxQuant score",137.8900000,1.0000000,,,,9.3996401119512E-5,
SSSLDLGVDPPSSR,ph,S,611,true,"Large-scale phosphorylation discovery",44,23111157,XCorr,3.6180000,,,,,,
SSSLDLGVDPPSSR,ph,S,611,true,"srk2dei ABA signaling phopshoproteomics",83,23572148,"MASCOT Score",28.0000000,,,,,,0.0004000
SSSLDLGVDPPSSR,ph,S,612,true,"Phosphorylation Early Elicitor Signaling",23,17317660,,,,,,,,
SSSLDLGVDPPSSR,ph,S,612,true,"Conserved plant phosphoproteome - Arabidopsis",61a,20466843,"MASCOT Score",67.0000000,1.0000000,,,,,
SSSLDLGVDPPSSR,ph,S,612,true,"srk2dei ABA signaling phopshoproteomics",83,23572148,"MASCOT Score",25.0000000,,,,,,-0.0001000
SSSLDLGVDPPSSR,ph,S,613,true,"Large-scale phosphorylation discovery",44,23111157,XCorr,4.1920000,,,,,,
SSSLDLGVDPPSSR,ph,S,613,true,"srk2dei ABA signaling phopshoproteomics",83,23572148,"MASCOT Score",39.0000000,,,,,,-0.0011000
SSSLDLGVDPPSSR,ph,S,613,true,"LAXIC - ABA stress",84a,23660473,XCorr,3.6400000,0.8940000,,,,0.00033216399606317,
SSSLDLGVDPPSSR,ph,S,613,true,"LAXIC - mannitol vs control",84b,23660473,XCorr,2.9100000,0.9150000,-1.1516926,,NO,0.020671399310231,
SSSLDLGVDPPSSR,ph,S,613,true,"SnRK2 protein kinase substrates",85,23776212,XCorr,3.2354186,0.9460000,,,,0.00073034898377955,
SSSLDLGVDPPSSR,ph,S,613,true,"atm and atr DNA damage response",88,25561503,"MASCOT Score",64.0000000,0.9960000,,,,,-2.2500000
SSSLDLGVDPPSSR,ph,S,613,true,"TOR Kinase and ABA Receptor",100,29290610,XCorr,3.5235274,0.9063000,,,,0.00066020002122968,
SSSLDLGVDPPSSR,ph,S,613,true,"Lateral root-induction - NAA vs control",106,23328941,"MASCOT Score",26.0000000,,-0.1104183,0.5456836,NO,,
SSSLDLGVDPPSSR,ph,S,613,true,"Phospho cell culture sucrose/TOR",109,30833711,,,0.9908360,,,,,
SSSLDLGVDPPSSR,ph,S,613,true,"Col-0 callus - FC Col-0 vs. Col-0 Xray",111a,31410901,,38.2300000,,0.3458139,0.0000000,NO,,0.6037576
SSSLDLGVDPPSSR,ph,S,613,true,"Col-0 X-ray callus - FC Col-0 vs. Col-0 Xray",111b,31410901,,38.2300000,,0.3458139,0.0000000,NO,,0.6037576
SSSLDLGVDPPSSR,ph,S,613,true,"atm callus - FC atm vs. atm Xray",111c,31410901,,38.2300000,,0.0129108,0.0000000,NO,,0.6037576
SSSLDLGVDPPSSR,ph,S,613,true,"atm-3 X-ray callus - FC atm vs. atm Xray",111d,31410901,,38.2300000,,0.0129108,0.0000000,NO,,0.6037576
SSSLDLGVDPPSSR,ph,S,613,true,"Tissue atlas Arabidopsis - ProteomicsDB",114,32188942,"MaxQuant score",251.8400000,0.9990830,,,,0,
DPPFHAVAPASNSHTSSAAAESTHSINK,fuc,S,635,true,"SPINDLY O-fucosylation",162,36739885,,,,,,,0.33000001311302,
GNLLSESHPTFSSLTAK,ph,S,686,true,"TOR Kinase and ABA Receptor",100,29290610,XCorr,3.0486712,0.8810000,,,,0.0027330000884831,
GNLLSESHPTFSSLTAK,ph,S,688,true,"Tissue atlas Arabidopsis - ProteomicsDB",114,32188942,"MaxQuant score",327.1700000,0.9999990,,,,0,
GNLLSESHPTFSSLTAK,ph,T,691,true,"Tissue atlas Arabidopsis - ProteomicsDB",114,32188942,"MaxQuant score",148.2000000,0.9985440,,,,6.0166901842684E-12,
GNLLSESHPTFSSLTAK,ph,T,696,true,"Tissue atlas Arabidopsis - ProteomicsDB",114,32188942,"MaxQuant score",103.8800000,0.9517370,,,,4.6258901420515E-6,
NERSSLEESNDAR,ph,S,708,true,"SnRK2 protein kinase substrates",85,23776212,XCorr,2.0510399,0.9000000,,,,0.028234500437975,
NERSSLEESNDAR,ph,S,708,true,"atm and atr DNA damage response",88,25561503,"MASCOT Score",39.0000000,1.0000000,,,,,-0.1000000
NERSSLEESNDAR,ph,S,708,true,"TOR Kinase and ABA Receptor",100,29290610,XCorr,3.9860148,0.9910000,,,,0.00029160000849515,
NERSSLEESNDAR,ph,S,708,true,"Tissue atlas Arabidopsis - ProteomicsDB",114,32188942,"MaxQuant score",115.6600000,0.9752120,,,,4.5341999793891E-5,
QPCSSTLEIVSK,sno,C,897,true,"hot5-4 / wildtype, FAT-switch S-nitrosoproteome",169,37277371,,,,0.2045835,0.0028194,NO,,
SYDPSDAIGTSSEEGYAGASK,ph,T,1049,true,"srk2dei ABA signaling phopshoproteomics",83,23572148,"MASCOT Score",24.0000000,,,,,,0.0002000
SYDPSDAIGTSSEEGYAGASK,ph,S,1050,true,"Large-scale phosphorylation discovery",44,23111157,XCorr,4.2570000,,,,,,
SYDPSDAIGTSSEEGYAGASK,ph,S,1050,true,"Conserved plant phosphoproteome - Arabidopsis",61a,20466843,"MASCOT Score",59.0000000,1.0000000,,,,,
SYDPSDAIGTSSEEGYAGASK,ph,S,1050,true,"srk2dei ABA signaling phopshoproteomics",83,23572148,"MASCOT Score",57.0000000,,,,,,-0.0023000
SYDPSDAIGTSSEEGYAGASK,ph,S,1050,true,"SnRK2 protein kinase substrates",85,23776212,XCorr,4.5331197,0.9120000,,,,1.4168500683809E-7,
SYDPSDAIGTSSEEGYAGASK,ph,S,1050,true,"TOR Kinase and ABA Receptor",100,29290610,XCorr,5.3810430,0.9842000,,,,6.7489997945813E-7,
SYDPSDAIGTSSEEGYAGASK,ph,S,1050,true,"Tissue atlas Arabidopsis - ProteomicsDB",114,32188942,"MaxQuant score",294.5200000,0.9959450,,,,0,
SYDPSDAIGTSSEEGYAGASK,ph,S,1051,true,"Conserved plant phosphoproteome - Arabidopsis",61a,20466843,"MASCOT Score",59.0000000,1.0000000,,,,,
SYDPSDAIGTSSEEGYAGASK,ph,S,1051,true,"srk2dei ABA signaling phopshoproteomics",83,23572148,"MASCOT Score",79.0000000,,,,,,-0.0017000
SYDPSDAIGTSSEEGYAGASK,ph,S,1051,true,"TOR Kinase and ABA Receptor",100,29290610,XCorr,5.3810430,0.9845000,,,,6.7489997945813E-7,
SYDPSDAIGTSSEEGYAGASK,ph,S,1051,true,"Phospho cell culture sucrose/TOR",109,30833711,,,0.9526440,,,,,
SYDPSDAIGTSSEEGYAGASK,ph,S,1051,true,"Tissue atlas Arabidopsis - ProteomicsDB",114,32188942,"MaxQuant score",307.9700000,0.9978580,,,,0,
SYDPSDAIGTSSEEGYAGASK,ph,Y,1055,true,"srk2dei ABA signaling phopshoproteomics",83,23572148,"MASCOT Score",20.0000000,,,,,,-0.0012000
SYDPSDAIGTSSEEGYAGASKK,ph,S,1059,true,"Tissue atlas Arabidopsis - ProteomicsDB",114,32188942,"MaxQuant score",82.6000000,0.8889840,,,,5.9861200440992E-8,
YSGGSIDSDSGRK,ph,Y,1068,true,"TOR Kinase and ABA Receptor",100,29290610,XCorr,2.6106868,0.8393000,,,,0.043839998543262,
YSGGSIDSDSGR,ph,S,1069,true,"Tissue atlas Arabidopsis - ProteomicsDB",114,32188942,"MaxQuant score",82.0690000,0.9980750,,,,0.0020176600664854,
YSGGSIDSDSGRK,ph,S,1072,true,"SnRK2 protein kinase substrates",85,23776212,XCorr,3.0723643,0.9880000,,,,0.016801299527287,
YSGGSIDSDSGRK,ph,S,1072,true,"atm and atr DNA damage response",88,25561503,"MASCOT Score",52.0000000,0.9880000,,,,,-0.3400000
YSGGSIDSDSGR,ph,S,1072,true,"atm and atr DNA damage response",88,25561503,"MASCOT Score",62.0000000,0.9960000,,,,,-0.0600000
YSGGSIDSDSGR,ph,S,1072,true,"Lateral root-induction - NAA vs control",106,23328941,"MASCOT Score",23.0000000,,,,,,
YSGGSIDSDSGR,ph,S,1072,true,"Tissue atlas Arabidopsis - ProteomicsDB",114,32188942,"MaxQuant score",169.5800000,1.0000000,,,,1.0955099776281E-14,
YSGGSIDSDSGRK,ph,S,1075,true,"atm and atr DNA damage response",88,25561503,"MASCOT Score",41.0000000,0.9550000,,,,,-0.5400000
YSGGSIDSDSGRK,ph,S,1075,true,"TOR Kinase and ABA Receptor",100,29290610,XCorr,4.1426635,0.8886000,,,,7.1009999373928E-6,
YSGGSIDSDSGRK,ph,S,1075,true,"Tissue atlas Arabidopsis - ProteomicsDB",114,32188942,"MaxQuant score",190.0300000,0.9985980,,,,3.280040059344E-24,
YSGGSIDSDSGR,ph,S,1075,true,"atm and atr DNA damage response",88,25561503,"MASCOT Score",62.0000000,0.9960000,,,,,-0.0600000
YSGGSIDSDSGR,ph,S,1075,true,"Lateral root-induction - NAA vs control",106,23328941,"MASCOT Score",34.0000000,,,,,,
TGISSASDLLNPK,ph,T,1112,true,"Tissue atlas Arabidopsis - ProteomicsDB",114,32188942,"MaxQuant score",166.6200000,0.9968780,,,,1.933119937454E-14,
TGISSASDLLNPK,ph,S,1116,true,"srk2dei ABA signaling phopshoproteomics",83,23572148,"MASCOT Score",37.0000000,,,,,,0.0004000
TGISSASDLLNPK,ph,S,1116,true,"TOR Kinase and ABA Receptor",100,29290610,XCorr,3.2001393,0.9782000,,,,2.1609999748762E-5,
TGISSASDLLNPK,ph,S,1116,true,"Tissue atlas Arabidopsis - ProteomicsDB",114,32188942,"MaxQuant score",202.1500000,0.9997330,,,,1.1807199329256E-38,
DSDYTFASAGQNSISR,ph,S,1137,true,"atm and atr DNA damage response",88,25561503,"MASCOT Score",49.0000000,1.0000000,,,,,0.3900000
DSDYTFASAGQNSISR,ph,S,1137,true,"Tissue atlas Arabidopsis - ProteomicsDB",114,32188942,"MaxQuant score",203.9200000,0.9761930,,,,0,
DSDYTFASAGQNSISR,ph,S,1139,true,"Tissue atlas Arabidopsis - ProteomicsDB",114,32188942,"MaxQuant score",103.8700000,0.7853580,,,,3.0613400667789E-6,
TSPNGSSENIEILDDLSPPHLEK,ph,T,1141,true,"SnRK2 protein kinase substrates",85,23776212,XCorr,5.0333586,0.9730000,,,,3.0837898634672E-7,
TSPNGSSENIEILDDLSPPHLEK,ph,T,1141,true,"TOR Kinase and ABA Receptor",100,29290610,XCorr,3.3183827,0.9169000,,,,7.6239998634264E-6,
TSPNGSSENIEILDDLSPPHLEK,ph,S,1142,true,"srk2dei ABA signaling phopshoproteomics",83,23572148,"MASCOT Score",50.0000000,,,,,,-0.0011000
TSPNGSSENIEILDDLSPPHLEK,ph,S,1142,true,"SnRK2 protein kinase substrates",85,23776212,XCorr,5.0333586,0.9730000,,,,3.0837898634672E-7,
TSPNGSSENIEILDDLSPPHLEK,ph,S,1142,true,"TOR Kinase and ABA Receptor",100,29290610,XCorr,4.4630361,0.9126000,,,,2.4560000255747E-8,
TSPNGSSENIEILDDLSPPHLEK,ph,S,1142,true,"Tissue atlas Arabidopsis - ProteomicsDB",114,32188942,"MaxQuant score",254.3200000,0.9478940,,,,0,
TSPNGSSENIEILDDLSPPHLEK,ph,S,1146,true,"Conserved plant phosphoproteome - Arabidopsis",61a,20466843,"MASCOT Score",25.0000000,0.8395566,,,,,
TSPNGSSENIEILDDLSPPHLEK,ph,S,1146,true,"srk2dei ABA signaling phopshoproteomics",83,23572148,"MASCOT Score",50.0000000,,,,,,-0.0011000
TSPNGSSENIEILDDLSPPHLEK,ph,S,1146,true,"TOR Kinase and ABA Receptor",100,29290610,XCorr,4.4630361,0.9126000,,,,2.4560000255747E-8,
TSPNGSSENIEILDDLSPPHLEK,ph,S,1147,true,"SnRK2 protein kinase substrates",85,23776212,XCorr,4.3853226,0.9410000,,,,6.4836798152612E-9,
TSPNGSSENIEILDDLSPPHLEK,ph,S,1147,true,"Col-0 callus - FC Col-0 vs. Col-0 Xray",111a,31410901,,30.2800000,,1.7128925,0.0000000,NO,,0.7375252
TSPNGSSENIEILDDLSPPHLEK,ph,S,1147,true,"Col-0 X-ray callus - FC Col-0 vs. Col-0 Xray",111b,31410901,,30.2800000,,1.7128925,0.0000000,NO,,0.7375252
TSPNGSSENIEILDDLSPPHLEK,ph,S,1147,true,"atm callus - FC atm vs. atm Xray",111c,31410901,,30.2800000,,2.3861023,0.0000000,NO,,0.7375252
TSPNGSSENIEILDDLSPPHLEK,ph,S,1147,true,"atm-3 X-ray callus - FC atm vs. atm Xray",111d,31410901,,30.2800000,,2.3861023,0.0000000,NO,,0.7375252
TSPNGSSENIEILDDLSPPHLEK,ph,S,1157,true,"Conserved plant phosphoproteome - Arabidopsis",61a,20466843,"MASCOT Score",26.0000000,1.0000000,,,,,
TSPNGSSENIEILDDLSPPHLEK,ph,S,1157,true,"SnRK2 protein kinase substrates",85,23776212,XCorr,4.3853226,0.9410000,,,,6.4836798152612E-9,
TSPNGSSENIEILDDLSPPHLEK,ph,S,1157,true,"Tissue atlas Arabidopsis - ProteomicsDB",114,32188942,"MaxQuant score",222.6600000,1.0000000,,,,0,
NGLNLTSVDSLEGR,ph,S,1170,true,"Lateral root-induction - NAA vs control",106,23328941,"MASCOT Score",26.0000000,,,,,,
NGLNLTSVDSLEGR,ph,S,1173,true,"Tyrosine phosphorylation in Arabidopsis",59,18463617,"MASCOT Score",64.0000000,,,,,,-1.1585197
NGLNLTSVDSLEGR,ph,S,1173,true,"atm and atr DNA damage response",88,25561503,"MASCOT Score",76.0000000,1.0000000,,,,,-0.3100000
NGLNLTSVDSLEGR,ph,S,1173,true,"Tissue atlas Arabidopsis - ProteomicsDB",114,32188942,"MaxQuant score",222.4500000,0.9999420,,,,0,
ELDLGHY,nt,E,1185,true,"Arg/N-end rule seed, prt6 vs. Wt",99,29168982,"MASCOT Score",46.0900000,,-2.3034350,0.1068572,NO,0.22139999270439,1.0382659
ELDLGHYMLTSIK,ph,T,1194,true,"Tissue atlas Arabidopsis - ProteomicsDB",114,32188942,"MaxQuant score",171.1400000,0.9908130,,,,1.1486500295301E-14,
VNTTPESGPSIPQILHMINGSDGSPSSSK,ph,S,1225,true,"TOR Kinase and ABA Receptor",100,29290610,XCorr,4.1527314,0.8155000,,,,0.00033889999031089,
