Peptide,PTM,ModifiedAA,ModifiedPosition,PeptideUniqueToGene,ExperimentDesc,ExpID,PubmedID,ScoreType,IdentScore,LocProb,Log2FChange,PQ-val,QuantSig,PEP,MassErrorPPM
VSASSSVKPEKDIR,nt,V,35,true,"Arabidopsis translation initiation landscape - NT",167b,35069635,,,,,,,,
SSSVKPEKDIRIGLLGASGY,nt,S,38,true,"Arabidopsis translation initiation landscape - NT",167b,35069635,,,,,,,,
IGLLGASGYTGAEIVR,nt,I,49,true,"Arabidopsis translation initiation landscape - NT",167b,35069635,,,,,,,,
ASGYTGAE,nt,A,54,true,"Arg/N-end rule seed, prt6 vs. Wt",99,29168982,"MASCOT Score",58.4500000,,-0.0627304,0.8862095,NO,0.0041260002180934,-0.1394272
AQKLPTLVSVK,ph,T,101,true,"Tissue atlas Arabidopsis - ProteomicsDB",114,32188942,"MaxQuant score",83.9660000,0.9918230,,,,0.0003528890083544,
LVANPGCYPTTIQLPLVPLLK,ox,C,193,true,"OxiTRAQ SA and flg22 responses - SA vs mock",91a,25720653,"MASCOT Score",46.4400000,,1.9963887,0.0170000,YES,,
LVANPGCYPTTIQLPLVPLLK,ox,C,193,true,"OxiTRAQ SA and flg22 responses - flg22 vs mock",91b,25720653,"MASCOT Score",46.4400000,,1.0356239,0.1530000,NO,,
GAKEANLYSEIAEGISSYGVTR,nt,G,230,true,"Arabidopsis translation initiation landscape - NT",167b,35069635,,,,,,,,
HVPEIEQGLSDVAQSK,ph,S,268,true,"Tissue atlas Arabidopsis - ProteomicsDB",114,32188942,"MaxQuant score",118.8400000,0.9999770,,,,1.4536199444137E-7,
SYEDEEFVK,nt,S,309,true,"N-terminal ChaFRADIC",92,26010716,"MASCOT Score",27.0900000,,,,,0.00030370001331903,
TTGLLHQPLFP,nt,T,379,true,"N-terminal ChaFRADIC",92,26010716,"MASCOT Score",37.5000000,,,,,0.0016870000399649,
