Peptide,PTM,ModifiedAA,ModifiedPosition,PeptideUniqueToGene,ExperimentDesc,ExpID,PubmedID,ScoreType,IdentScore,LocProb,Log2FChange,PQ-val,QuantSig,PEP,MassErrorPPM
ATVPGQLIWE,nt,A,2,false,"Arg/N-end rule seed, prt6 vs. Wt",99,29168982,"MASCOT Score",34.4800000,,-0.4182514,0.3337954,NO,0.0039079999551177,3.9167471
ATVPGQLIWEIVKNNNCFLVKQFGR,nta,A,2,true,"Arg/N-end rule pathway Roots",80,25728785,"MASCOT Score",38.4000000,,,,,0.00044259999413043,
ATVPGQLIWEIVKNNNCF,nta,A,2,true,"Arg/N-end rule pathway Roots",80,25728785,"MASCOT Score",42.2800000,,,,,0.0015279999934137,
NNCFLVK,acy,C,18,false,"Arabidopsis S-acylation atlas - Hypocotyl",163b,35681017,,,,,,,,
NNNCFLVK,ox,C,18,true,"OxiTRAQ Arabidopsis - 5 mM H2O2 versus control",47,24376095,,,,0.1823955,0.3282210,NO,,
NNCFLVK,ox,C,18,false,"OxiTRAQ Arabidopsis - 5 mM H2O2 versus control",47,24376095,,,,0.0746118,0.5777323,NO,,
NNNCFLVK,sno,C,18,true,"hot5-4 / wildtype, FAT-switch S-nitrosoproteome",169,37277371,,,,,,,,
NNNCFLVK,so,C,18,true,"S-sulfenylation site detection using YAP1C",110,32714340,,,,,,,,
NNCFLVK,so,C,18,false,"S-sulfenylation site detection using YAP1C",110,32714340,,,,,,,,
LVKQFGR,nt,L,20,false,"Metacaspase9 substrates - Col-0 / mc9",51a,23964026,"MASCOT Score",52.0000000,,1.1224081,,NO,,0.5027058
GNSKVQFSK,ac,K,30,true,"Quantitative Acetylproteomics",101,29440448,,,,,,,,
SKETNNLTNVHSY,nt,S,34,true,"Arabidopsis translation initiation landscape - NT",167b,35069635,,,,,,,,
ETNNLTNVHSYK,ac,K,47,true,"Quantitative Acetylproteomics",101,29440448,,,,,,,,
HSGLANKK,ac,K,54,false,"Quantitative Acetylproteomics",101,29440448,,,,,,,,
VNKSILKKEFPR,nt,V,85,true,"Metacaspase9 substrates - Col-0 / mc9",51a,23964026,"MASCOT Score",66.0000000,,1.6369825,,NO,,-1.7672920
VNKSILKKEFPR,nt,V,85,true,"Metacaspase9 substrates - 35S:MC9 / mc9",51b,23964026,"MASCOT Score",58.0000000,,1.3162842,,NO,,0.3990668
LSVNKSILKK,ac,K,87,false,"Quantitative Acetylproteomics",101,29440448,,,,,,,,
LSVNKSILK,ac,K,87,false,"Quantitative Acetylproteomics",101,29440448,,,,,,,,
SILKKEFPR,nt,S,88,true,"Metacaspase9 substrates - Col-0 / mc9",51a,23964026,"MASCOT Score",45.0000000,,1.5637767,,NO,,0.2240761
SILKKEFPR,nt,S,88,true,"Metacaspase9 substrates - 35S:MC9 / mc9",51b,23964026,"MASCOT Score",45.0000000,,2.2616425,,NO,,-0.4481518
LSVNKSILK,ph,S,88,false,"Tissue atlas Arabidopsis - ProteomicsDB",114,32188942,"MaxQuant score",113.0100000,0.9999990,,,,0.00011773299775086,
EFPRMSK,mox,M,97,true,"cat2 Methionine oxidation - 1h stress",62a,25693801,"MASCOT Score",38.0000000,,-0.4074446,,NO,,
AVANQVVDNYYRPDLKK,ac,K,115,true,"Histone deacetylases substrates - TSA vs control",98b,29061669,"MaxQuant Score",48.2000000,1.0000000,0.4180000,0.9977001,NO,0.003000000026077,
AVANQVVDNYYRPDLKK,ub,K,115,true,"Ubiquitination Membrane Proteins",120,33585938,,,,,,,,
AVANQVVDNYYRPDLKK,ub,K,115,true,"upl3 mutant / wildtype",168,35926874,"MaxQuant score",121.8200000,1.0000000,-0.5332424,0.1540200,NO,7.1667599632619E-10,-0.4307000
SAISKGLR,nt,S,123,false,"Metacaspase9 substrates - 35S:MC9 / mc9",51b,23964026,"MASCOT Score",56.0000000,,2.2504513,,NO,,0.3065580
LSAISKGLR,ub,K,127,false,"Arabidopsis ubiquitination COFRADIC",40,26744219,"MaxQuant Score",179.3700000,1.0000000,,,,0,-0.1360000
VAKSGAKQR,ub,K,133,true,"Arabidopsis ubiquitination COFRADIC",40,26744219,"MaxQuant Score",155.0600000,1.0000000,,,,1.6790000501032E-8,0.3150000
VAKSGAKQR,ub,K,137,true,"Arabidopsis ubiquitination COFRADIC",40,26744219,"MaxQuant Score",155.0600000,1.0000000,,,,1.6790000501032E-8,0.3150000
