Peptide,PTM,ModifiedAA,ModifiedPosition,PeptideUniqueToGene,ExperimentDesc,ExpID,PubmedID,ScoreType,IdentScore,LocProb,Log2FChange,PQ-val,QuantSig,PEP,MassErrorPPM
MESDEAAAVSPQATTPSGGTGASGPKKR,nta,M,1,true,"Arg/N-end rule pathway Roots",80,25728785,"MASCOT Score",73.8400000,,,,,2.6969999453286E-5,
MESDEAAAVSPQATTPSGGTGASGPKKR,nta,M,1,true,"Arg/N-end rule seed, prt6 vs. Wt",99,29168982,"MASCOT Score",47.1000000,,-0.1354015,0.4970406,NO,0.0045560002326965,-3.1714251
MESDEAAAVSPQATTPSGGTGASGPKKR,nta,M,1,true,"HUNTER N-terminome: legumain, GluC and trypsin",119,31951383,"MaxQuant score",63.0290000,,,,,,
MESDEAAAVSPQATTPSGGTGASGPKKR,nta,M,1,true,"Arabidopsis translation initiation landscape - NTA",167a,35069635,,,,,,,,
MESDEAAAVSPQATTPSGGTGASGPK,nta,M,1,true,"Characterization plant N-terminal acetylation",6,22223895,"MASCOT Score",59.0100000,,,,,,
MESDEAAAVS,nta,M,1,true,"N-term acetylation drought responses",5,26184543,,,,,,,,
MESDEAAAVSPQATTPSGGTGASGPK,ph,S,3,true,"atm and atr DNA damage response",88,25561503,"MASCOT Score",68.0000000,1.0000000,,,,,0.2000000
MESDEAAAVSPQATTPSGGTGASGPK,ph,S,3,true,"TOR Kinase and ABA Receptor",100,29290610,XCorr,5.6742206,1.0000000,,,,3.7780000639032E-6,
MESDEAAAVSPQATTPSGGTGASGPK,ph,S,3,true,"Lateral root-induction - NAA vs control",106,23328941,"MASCOT Score",44.0000000,,,,,,
MESDEAAAVSPQATTPSGGTGASGPK,ph,S,3,true,"Phospho cell culture sucrose/TOR",109,30833711,,,0.9999990,,,,,
MESDEAAAVSPQATTPSGGTGASGPK,ph,S,3,true,"Tissue atlas Arabidopsis - ProteomicsDB",114,32188942,"MaxQuant score",278.7900000,1.0000000,,,,0,
MESDEAAAVSPQATTPSGGTGASGPKK,ph,S,10,true,"Protein sumoylation and phosphorylation cross-talk",97,28419593,,,,,,,,
MESDEAAAVSPQATTPSGGTGASGPK,ph,S,10,true,"atm and atr DNA damage response",88,25561503,"MASCOT Score",109.0000000,1.0000000,,,,,-1.3600000
MESDEAAAVSPQATTPSGGTGASGPK,ph,S,10,true,"TOR Kinase and ABA Receptor",100,29290610,XCorr,5.7807403,1.0000000,,,,5.6699998862708E-11,
MESDEAAAVSPQATTPSGGTGASGPK,ph,S,10,true,"Lateral root-induction - NAA vs control",106,23328941,"MASCOT Score",44.0000000,,,,,,
MESDEAAAVSPQATTPSGGTGASGPK,ph,S,10,true,"Phospho cell culture sucrose/TOR",109,30833711,,,0.9998320,,,,,
MESDEAAAVSPQATTPSGGTGASGPK,ph,S,10,true,"Tissue atlas Arabidopsis - ProteomicsDB",114,32188942,"MaxQuant score",347.4600000,1.0000000,,,,0,
MESDEAAAVSPQATTPSGGTGASGPK,ph,T,14,true,"atm and atr DNA damage response",88,25561503,"MASCOT Score",36.0000000,0.7710000,,,,,-1.1800000
MESDEAAAVSPQATTPSGGTGASGPK,ph,T,15,true,"atm and atr DNA damage response",88,25561503,"MASCOT Score",31.0000000,0.9890000,,,,,-0.4100000
TKEDSQTPSSQQQSDVK,ph,S,38,true,"Tissue atlas Arabidopsis - ProteomicsDB",114,32188942,"MaxQuant score",128.7900000,0.9945270,,,,1.8402700474596E-9,
EDSQTPSSQQQSDVK,ph,S,38,true,"LAXIC - ABA stress",84a,23660473,XCorr,3.0700000,1.0000000,,,,0.34174498915672,
EDSQTPSSQQQSDVK,ph,S,38,true,"LAXIC - mannitol vs control",84b,23660473,XCorr,2.8400000,0.9980000,,,,0.12428600341082,
EDSQTPSSQQQSDVK,ph,S,38,true,"SnRK2 protein kinase substrates",85,23776212,XCorr,2.4296703,1.0000000,,,,0.059742599725723,
TKEDSQTPSSQQQSDVK,ph,T,40,true,"Large-scale phosphorylation discovery",44,23111157,XCorr,4.4020000,,,,,,
TKEDSQTPSSQQQSDVK,ph,T,40,true,"Tissue atlas Arabidopsis - ProteomicsDB",114,32188942,"MaxQuant score",182.7700000,0.9981890,,,,3.7920898566566E-30,
EDSQTPSSQQQSDVK,ph,T,40,true,"LAXIC - ABA stress",84a,23660473,XCorr,3.0700000,0.9560000,,,,0.34174498915672,
EDSQTPSSQQQSDVK,ph,T,40,true,"LAXIC - mannitol vs control",84b,23660473,XCorr,2.8400000,0.9400000,,,,0.12428600341082,
EDSQTPSSQQQSDVK,ph,T,40,true,"SnRK2 protein kinase substrates",85,23776212,XCorr,2.4296703,0.9780000,,,,0.059742599725723,
TKEDSQTPSSQQQSDVK,ph,S,42,true,"Large-scale phosphorylation discovery",44,23111157,XCorr,3.0520000,,,,,,
TKEDSQTPSSQQQSDVK,ph,S,42,true,"Tissue atlas Arabidopsis - ProteomicsDB",114,32188942,"MaxQuant score",190.9400000,0.9725030,,,,9.7873999526429E-39,
TKEDSQTPSSQQQSDVK,ph,S,43,true,"Tissue atlas Arabidopsis - ProteomicsDB",114,32188942,"MaxQuant score",235.6800000,0.9555350,,,,0,
EDSQTPSSQQQSDVK,ph,S,43,true,"atm and atr DNA damage response",88,25561503,"MASCOT Score",57.0000000,0.9570000,,,,,-1.7000000
EDSQTPSSQQQSDVK,ph,S,47,true,"LAXIC - ABA stress",84a,23660473,XCorr,3.0700000,0.9560000,,,,0.34174498915672,
EDSQTPSSQQQSDVK,ph,S,47,true,"LAXIC - mannitol vs control",84b,23660473,XCorr,2.8400000,0.9400000,,,,0.12428600341082,
EDSQTPSSQQQSDVK,ph,S,47,true,"SnRK2 protein kinase substrates",85,23776212,XCorr,2.4296703,0.9780000,,,,0.059742599725723,
EDSQTPSSQQQSDVK,ph,S,47,true,"Tissue atlas Arabidopsis - ProteomicsDB",114,32188942,"MaxQuant score",91.0700000,0.7741600,,,,8.8805500126909E-5,
TKEDSQTPSSQQQSDVKMK,ac,K,50,true,"Quantitative Acetylproteomics",101,29440448,,,,,,,,
TQQSPSVDEKYSQWK,ph,S,61,true,"Tissue atlas Arabidopsis - ProteomicsDB",114,32188942,"MaxQuant score",187.7600000,0.9970710,,,,2.3765001078146E-10,
KTQQSPSVDEK,ph,S,61,true,"Large-scale phosphorylation discovery",44,23111157,XCorr,3.3320000,,,,,,
KTQQSPSVDEK,ph,S,61,true,"atm and atr DNA damage response",88,25561503,"MASCOT Score",47.0000000,1.0000000,,,,,-1.9800000
TQQSPSVDEK,ph,S,61,true,"SnRK2 protein kinase substrates",85,23776212,XCorr,2.0855794,0.9930000,,,,0.0344940982759,
TQQSPSVDEK,ph,S,61,true,"atm and atr DNA damage response",88,25561503,"MASCOT Score",41.0000000,1.0000000,,,,,-1.5500000
TQQSPSVDEK,ph,S,61,true,"Protein sumoylation and phosphorylation cross-talk",97,28419593,,,,,,,,
TQQSPSVDEK,ph,S,61,true,"Phospho cell culture sucrose/TOR",109,30833711,,,0.9810270,,,,,
QTDGSVPNTLVIANCE,nt,Q,116,true,"HUNTER N-terminome: legumain, GluC and trypsin",119,31951383,"MaxQuant score",94.4020000,,,,,,
VAAAEHISQFNEEARSPFVK,ph,S,144,true,"Tissue atlas Arabidopsis - ProteomicsDB",114,32188942,"MaxQuant score",117.6200000,0.8738530,,,,4.1309100237696E-13,
VAAAEHISQFNEEARSPFVK,ph,S,152,true,"TOR Kinase and ABA Receptor",100,29290610,XCorr,4.1678553,1.0000000,,,,7.7759999840055E-5,
VAAAEHISQFNEEARSPFVK,ph,S,152,true,"Phospho cell culture sucrose/TOR",109,30833711,,,0.9892480,,,,,
VAAAEHISQFNEEARSPFVK,ph,S,152,true,"Tissue atlas Arabidopsis - ProteomicsDB",114,32188942,"MaxQuant score",187.1300000,0.9999990,,,,1.8216880036223E-44,
QTGEGTDKNESPTVGPR,ph,S,279,true,"atm and atr DNA damage response",88,25561503,"MASCOT Score",26.0000000,1.0000000,,,,,0.5500000
QTGEGTDKNESPTVGPR,ph,S,279,true,"Tissue atlas Arabidopsis - ProteomicsDB",114,32188942,"MaxQuant score",110.2400000,0.9916160,,,,1.3885600225194E-8,
NESPTVGPR,ph,S,279,true,"TOR Kinase and ABA Receptor",100,29290610,XCorr,2.5806458,0.9906000,,,,0.00052940001478419,
KLTANGVGSPIYK,ph,S,377,true,"Tissue atlas Arabidopsis - ProteomicsDB",114,32188942,"MaxQuant score",118.2600000,0.9999970,,,,6.9172499934211E-5,
SPAGLFFQHAGHR,ph,S,429,true,"atm and atr DNA damage response",88,25561503,"MASCOT Score",52.0000000,1.0000000,,,,,-1.0700000
SPAGLFFQHAGHR,ph,S,429,true,"Tissue atlas Arabidopsis - ProteomicsDB",114,32188942,"MaxQuant score",137.2100000,1.0000000,,,,7.7650302046095E-6,
SHVMTCASKP,ox,C,503,true,"OxiTRAQ Arabidopsis - 5 mM H2O2 versus control",47,24376095,,,,0.3895920,0.0529293,NO,,
