Peptide,PTM,ModifiedAA,ModifiedPosition,PeptideUniqueToGene,ExperimentDesc,ExpID,PubmedID,ScoreType,IdentScore,LocProb,Log2FChange,PQ-val,QuantSig,PEP,MassErrorPPM
DGSENASNVDSEQK,ph,S,144,true,"Tissue atlas Arabidopsis - ProteomicsDB",114,32188942,"MaxQuant score",185.1900000,1.0000000,,,,5.8707299934699E-23,
LETLDETSEGEEAK,ph,T,180,true,"srk2dei ABA signaling phopshoproteomics",83,23572148,"MASCOT Score",65.0000000,,,,,,0.0005000
RKLETLDETSEGEEAK,ph,T,184,true,"srk2dei ABA signaling phopshoproteomics",83,23572148,"MASCOT Score",47.0000000,,,,,,-0.0014000
KLETLDETSEGEEAK,ph,T,184,true,"Large-scale phosphorylation discovery",44,23111157,XCorr,3.0730000,,,,,,
KLETLDETSEGEEAK,ph,T,184,true,"Tyrosine phosphorylation in Arabidopsis",59,18463617,"MASCOT Score",54.0000000,,,,,,-0.2844529
KLETLDETSEGEEAK,ph,T,184,true,"LAXIC - ABA stress",84a,23660473,XCorr,5.0600000,0.9510000,,,,0.0019823301117867,
KLETLDETSEGEEAK,ph,T,184,true,"Tissue atlas Arabidopsis - ProteomicsDB",114,32188942,"MaxQuant score",182.6400000,1.0000000,,,,8.9716302725313E-25,
LETLDETSEGEEAK,ph,T,184,true,"Tyrosine phosphorylation in Arabidopsis",59,18463617,"MASCOT Score",74.0000000,,,,,,-0.6136231
LETLDETSEGEEAK,ph,T,184,true,"Chloroplast kinase substrates",60,19376835,"MASCOT Score",35.1300000,,,,,,-1.4515000
LETLDETSEGEEAK,ph,T,184,true,"srk2dei ABA signaling phopshoproteomics",83,23572148,"MASCOT Score",82.0000000,,,,,,-0.0001000
LETLDETSEGEEAK,ph,T,184,true,"LAXIC - mannitol vs control",84b,23660473,XCorr,4.8700000,0.9980000,-1.0773468,,NO,0.001785850035958,
LETLDETSEGEEAK,ph,T,184,true,"SnRK2 protein kinase substrates",85,23776212,XCorr,3.9409864,0.9590000,,,,4.0503400668968E-5,
LETLDETSEGEEAK,ph,T,184,true,"TOR Kinase and ABA Receptor",100,29290610,XCorr,4.9499974,0.9346000,,,,4.3450000930534E-7,
KLETLDETSEGEEAKGSDLK,ph,S,185,true,"SnRK2 protein kinase substrates",85,23776212,XCorr,2.9528048,0.8000000,,,,0.004449849948287,
RKLETLDETSEGEEAK,ph,S,185,true,"Tyrosine phosphorylation in Arabidopsis",59,18463617,"MASCOT Score",47.0000000,,,,,,-0.7837563
RKLETLDETSEGEEAK,ph,S,185,true,"srk2dei ABA signaling phopshoproteomics",83,23572148,"MASCOT Score",53.0000000,,,,,,-0.0011000
RKLETLDETSEGEEAK,ph,S,185,true,"TOR Kinase and ABA Receptor",100,29290610,XCorr,3.8406870,0.9142000,,,,1.0779999684019E-5,
KLETLDETSEGEEAK,ph,S,185,true,"Arabidopsis root NAA phosphoproteome",18a,27643528,"MaxQuant Score",119.4600000,0.8270000,,,,3.9000001145206E-12,-0.1170000
KLETLDETSEGEEAK,ph,S,185,true,"Tyrosine phosphorylation in Arabidopsis",59,18463617,"MASCOT Score",84.0000000,,,,,,-0.9102499
KLETLDETSEGEEAK,ph,S,185,true,"Chloroplast kinase substrates",60,19376835,"MASCOT Score",48.0300000,,,,,,-1.3555000
KLETLDETSEGEEAK,ph,S,185,true,"Conserved plant phosphoproteome - Arabidopsis",61a,20466843,"MASCOT Score",54.0000000,1.0000000,,,,,
KLETLDETSEGEEAK,ph,S,185,true,"srk2dei ABA signaling phopshoproteomics",83,23572148,"MASCOT Score",35.0000000,,,,,,-0.0002000
KLETLDETSEGEEAK,ph,S,185,true,"LAXIC - mannitol vs control",84b,23660473,XCorr,5.5100000,0.9660000,-1.2642520,,NO,6.4699997892603E-5,
KLETLDETSEGEEAK,ph,S,185,true,"SnRK2 protein kinase substrates",85,23776212,XCorr,4.9798841,0.9700000,,,,2.5066299036425E-10,
KLETLDETSEGEEAK,ph,S,185,true,"atm and atr DNA damage response",88,25561503,"MASCOT Score",61.0000000,0.9990000,,,,,-1.3100000
KLETLDETSEGEEAK,ph,S,185,true,"TOR Kinase and ABA Receptor",100,29290610,XCorr,5.7745666,0.9411000,,,,2.5529999447826E-7,
KLETLDETSEGEEAK,ph,S,185,true,"Phospho cell culture sucrose/TOR",109,30833711,,,0.9937530,,,,,
KLETLDETSEGEEAK,ph,S,185,true,"Col-0 callus - FC Col-0 vs. Col-0 Xray",111a,31410901,,63.4000000,,-1.3560130,0.0000000,NO,,1.0946730
KLETLDETSEGEEAK,ph,S,185,true,"Col-0 X-ray callus - FC Col-0 vs. Col-0 Xray",111b,31410901,,63.4000000,,-1.3560130,0.0000000,NO,,1.0946730
KLETLDETSEGEEAK,ph,S,185,true,"atm callus - FC atm vs. atm Xray",111c,31410901,,63.4000000,,-1.0030124,0.0000000,NO,,1.0946730
KLETLDETSEGEEAK,ph,S,185,true,"atm-3 X-ray callus - FC atm vs. atm Xray",111d,31410901,,63.4000000,,-1.0030124,0.0000000,NO,,1.0946730
KLETLDETSEGEEAK,ph,S,185,true,"Tissue atlas Arabidopsis - ProteomicsDB",114,32188942,"MaxQuant score",411.0800000,1.0000000,,,,0,
LETLDETSEGEEAK,ph,S,185,true,"Tyrosine phosphorylation in Arabidopsis",59,18463617,"MASCOT Score",52.0000000,,,,,,-0.6136231
LETLDETSEGEEAK,ph,S,185,true,"srk2dei ABA signaling phopshoproteomics",83,23572148,"MASCOT Score",74.0000000,,,,,,-0.0009000
LETLDETSEGEEAK,ph,S,185,true,"atm and atr DNA damage response",88,25561503,"MASCOT Score",42.0000000,1.0000000,,,,,0.1000000
KLETLDETSEGEEAKGSDLK,ph,S,193,true,"Tissue atlas Arabidopsis - ProteomicsDB",114,32188942,"MaxQuant score",125.1500000,1.0000000,,,,3.3483801357559E-17,
LETLDETSEGEEAKGSDLK,ph,S,193,true,"Phospho cell culture sucrose/TOR",109,30833711,,,0.8068750,,,,,
LITSALK,ph,S,215,true,"Tissue atlas Arabidopsis - ProteomicsDB",114,32188942,"MaxQuant score",108.7400000,0.9666970,,,,0.005009280052036,
