Peptide,PTM,ModifiedAA,ModifiedPosition,PeptideUniqueToGene,ExperimentDesc,ExpID,PubmedID,ScoreType,IdentScore,LocProb,Log2FChange,PQ-val,QuantSig,PEP,MassErrorPPM
SGLEDIKNETVDLE,nt,S,2,true,"N-terminal ChaFRADIC",92,26010716,"MASCOT Score",23.8400000,,,,,0.051240000873804,
SGLEDIKNET,nt,S,2,true,"N-term acetylation drought responses",5,26184543,,,,,,,,
SGLEDIKNE,nt,S,2,true,"N-terminal ChaFRADIC",92,26010716,"MASCOT Score",28.6700000,,,,,0.050870001316071,
SGLEDIKNETVDLEKIPIEEVFQQL,nta,S,2,true,"Arabidopsis translation initiation landscape - NTA",167a,35069635,,,,,,,,
SGLEDIKNETVDLE,nta,S,2,true,"N-terminal ChaFRADIC",92,26010716,"MASCOT Score",23.8400000,,,,,0.051240000873804,
SGLEDIKNET,nta,S,2,true,"N-term acetylation drought responses",5,26184543,,,,,,,,
SGLEDIKNE,nta,S,2,true,"N-terminal ChaFRADIC",92,26010716,"MASCOT Score",28.6700000,,,,,0.050870001316071,
SGLEDIKNE,nta,S,2,true,"HUNTER N-terminome: legumain, GluC and trypsin",119,31951383,"MaxQuant score",144.3800000,,,,,,
SGLEDIKNETVDLEK,ph,S,2,true,"Phosphorylation Early Elicitor Signaling",23,17317660,,,,,,,,
SGLEDIKNETVDLEK,ph,S,2,true,"Phosphorylation in N starvation",63,22060019,"MASCOT Score",99.0000000,,,,,,-0.1154160
SGLEDIKNETVDLEK,ph,S,2,true,"atm and atr DNA damage response",88,25561503,"MASCOT Score",43.0000000,1.0000000,,,,,-1.0100000
SGLEDIKNETVDLEK,ph,S,2,true,"Tissue atlas Arabidopsis - ProteomicsDB",114,32188942,"MaxQuant score",308.0000000,1.0000000,,,,0,
SGLEDIKNETVDLEK,ac,K,8,true,"Histone deacetylases- hda14 vs WT (low light)",98c,29061669,"MaxQuant Score",95.2000000,1.0000000,0.0580000,0.9931160,NO,0.0020000000949949,
SGLEDIKNETVDLEK,ub,K,8,true,"upl3 mutant / wildtype",168,35926874,"MaxQuant score",184.0200000,1.0000000,1.5597365,0.0700990,NO,1.7586099271251E-26,-1.2166000
SGLEDIKNETVDLEK,ph,T,11,true,"Tissue atlas Arabidopsis - ProteomicsDB",114,32188942,"MaxQuant score",159.0400000,1.0000000,,,,1.2282100250033E-12,
IPIEEVFQQLKCTR,ub,K,27,true,"Ubiquitination Membrane Proteins",120,33585938,,,,,,,,
IPIEEVFQQLKCTR,ub,K,27,true,"upl3 mutant / wildtype",168,35926874,"MaxQuant score",246.5000000,1.0000000,0.7765252,0.3722800,NO,0,1.8123000
EGLTTQEGEDR,nt,E,31,false,"Arg/N-end rule pathway Roots",80,25728785,"MASCOT Score",43.4900000,,,,,0.01714999973774,
EGLTTQEGEDR,ph,T,35,false,"SIRK1 phosphorylation",86a,23820729,"MaxQuant Score",59.1250000,0.9090000,,,,0.86799997091293,1.7160000
EGLTTQEGEDR,ph,T,35,false,"SIRK1 exp - sirk1 mutant vs WT",86b,23820729,,,,0.3359413,,NO,,
EGLTTQEGEDR,ph,T,35,false,"SIRK1 exp - 35S:SIRK1 vs WT",86c,23820729,,,,0.4831819,,NO,,
IVIFGPNKLEEK,ub,K,49,true,"upl3 mutant / wildtype",168,35926874,"MaxQuant score",89.3010000,1.0000000,0.1839628,0.6309200,NO,9.256909834221E-5,0.1891200
VLRDGKWSEQEAAILVPGDIVSIK,ub,K,139,false,"Ubiquitination Membrane Proteins",120,33585938,,,,,,,,
DGKWSEQEAAILVPGDIVSIK,ub,K,139,false,"Ubiquitination Membrane Proteins",120,33585938,,,,,,,,
DGKWSEQEAAILVPGDIVSIK,ub,K,139,false,"upl3 mutant / wildtype",168,35926874,"MaxQuant score",177.3200000,1.0000000,1.0172093,0.5236600,NO,4.2568900346099E-37,-1.0706000
LLEGDPLKVDQSALTGESLPVTK,ub,K,175,false,"Ubiquitination Membrane Proteins",120,33585938,,,,,,,,
LLEGDPLKVDQSALTGESLPVTK,ub,K,175,false,"upl3 mutant / wildtype",168,35926874,"MaxQuant score",150.1400000,1.0000000,1.1096949,0.0328840,YES,3.455900032084E-25,-0.5688900
HPGQEVFSGSTCK,sno,C,202,false,"Site-specific nitrosomeproteomic id - gsnor1-3",90a,25699590,XCorr,2.0105643,,,,,0.00070330000016838,-3.8952615
HPGQEVFSGSTCK,sno,C,202,false,"hot5-4 / wildtype, FAT-switch S-nitrosoproteome",169,37277371,,,,0.3706155,0.0396725,NO,,
LSQQGAITKR,ac,K,312,false,"Quantitative Acetylproteomics",101,29440448,,,,,,,,
LSQQGAITKR,ub,K,312,false,"Ubiquitination Membrane Proteins",120,33585938,,,,,,,,
MTAIEEMAGMDVLCSDK,ph,T,315,false,"Brassinosteroid-Regulated Phosphorylation Dynamics",94,26187819,"MaxQuant Score",58.9140000,1.0000000,,,,0.01799999922514,-0.0650000
MTAIEEMAGMDVLCSDK,ph,S,328,false,"Phosphorylation in N starvation",63,22060019,"MASCOT Score",99.0000000,,,,,,-1.1356600
MTAIEEMAGMDVLCSDK,ph,S,328,false,"Brassinosteroid-Regulated Phosphorylation Dynamics",94,26187819,"MaxQuant Score",58.9140000,1.0000000,,,,0.01799999922514,-0.0650000
RMTAIEEMAGMDVLCSDKTGTLTLNK,ub,K,330,false,"Arabidopsis ubiquitination by TUBEs",2,23667124,,,,,,,,
TGTLTLNK,ph,T,335,false,"Tissue atlas Arabidopsis - ProteomicsDB",114,32188942,"MaxQuant score",123.4200000,0.9975070,,,,0.0081411302089691,
TGTLTLNKLSVDK,ub,K,338,false,"Ubiquitination Membrane Proteins",120,33585938,,,,,,,,
TGTLTLNKLSVDK,ub,K,338,false,"upl3 mutant / wildtype",168,35926874,"MaxQuant score",171.7300000,1.0000000,-0.3400754,0.4685600,NO,1.1702800428657E-16,-1.0035000
LSVDKNLVEVFCK,cr,K,343,false,"Open search Plant PTM Viewer 2.0 - Crotonylation",164c,TBA,,,,,,,,
LSVDKNLVEVFCK,ub,K,343,false,"Ubiquitination Membrane Proteins",120,33585938,,,,,,,,
LSVDKNLVEVFCK,ub,K,343,false,"upl3 mutant / wildtype",168,35926874,"MaxQuant score",128.9500000,1.0000000,0.7407117,0.0413370,YES,6.952460012144E-7,0.5412000
NLVEVFCK,sno,C,350,false,"hot5-4 / wildtype, FAT-switch S-nitrosoproteome",169,37277371,,,,0.4763779,0.0159811,NO,,
LSVDKNLVEVFCKGVEK,ub,K,351,false,"Ubiquitination Membrane Proteins",120,33585938,,,,,,,,
NLVEVFCKGVEK,ub,K,351,false,"Ubiquitination Membrane Proteins",120,33585938,,,,,,,,
NLVEVFCKGVEK,ub,K,351,false,"upl3 mutant / wildtype",168,35926874,"MaxQuant score",140.4500000,1.0000000,1.2732175,0.1227200,NO,5.6333298026345E-9,0.2646300
VENQDAIDAAMVGMLADPKEAR,ub,K,386,false,"Ubiquitination Membrane Proteins",120,33585938,,,,,,,,
VENQDAIDAAMVGMLADPKEAR,ub,K,386,false,"upl3 mutant / wildtype",168,35926874,"MaxQuant score",106.6300000,1.0000000,0.6906406,0.4766800,NO,2.0703499678532E-11,-1.4646000
EVHFLPFNPVDKR,ac,K,405,false,"Histone deacetylases - apicidin vs control",98a,29061669,"MaxQuant Score",84.4000000,1.0000000,0.0460000,0.7709035,NO,0.00093999999808148,
EVHFLPFNPVDKR,ac,K,405,false,"Quantitative Acetylproteomics",101,29440448,,,,,,,,
EVHFLPFNPVDKR,ub,K,405,false,"upl3 mutant / wildtype",168,35926874,"MaxQuant score",77.2790000,1.0000000,0.1269729,0.7713800,NO,0.00012278200301807,1.2508000
KKVLSCIDK,ub,K,441,true,"Ubiquitination Membrane Proteins",120,33585938,,,,,,,,
KVLSCIDKYAER,ub,K,442,true,"Ubiquitination Membrane Proteins",120,33585938,,,,,,,,
KKVLSCIDK,ub,K,442,true,"Ubiquitination Membrane Proteins",120,33585938,,,,,,,,
KVLSCIDK,ub,K,442,true,"upl3 mutant / wildtype",168,35926874,"MaxQuant score",56.9160000,1.0000000,0.3774014,0.2054000,NO,0.014865799807012,-0.3334100
VLSCIDK,sno,C,446,true,"hot5-4 / wildtype, FAT-switch S-nitrosoproteome",169,37277371,,,,0.6877816,0.0162744,YES,,
VLSCIDKYAER,ub,K,449,true,"Ubiquitination Membrane Proteins",120,33585938,,,,,,,,
VLSCIDKYAER,ub,K,449,true,"upl3 mutant / wildtype",168,35926874,"MaxQuant score",113.6900000,1.0000000,0.4667576,0.5612600,NO,2.263500027766E-5,-1.0429000
TKESPGGPWEFVGLLPLFDPPR,ub,K,470,true,"upl3 mutant / wildtype",168,35926874,"MaxQuant score",75.5390000,1.0000000,1.4059924,,,4.2269098230463E-6,-1.0187000
MITGDQLAIGK,ph,T,511,false,"Phosphorylation Early Elicitor Signaling",23,17317660,,,,,,,,
LGMGTNMYPSAALLGTDKDSNIASIPVEELIEK,ph,S,548,true,"TOR Kinase and ABA Receptor",100,29290610,XCorr,3.3828590,0.7958000,,,,0.020640000700951,
DSNIASIPVEELIEK,ph,S,548,true,"TOR Kinase and ABA Receptor",100,29290610,XCorr,3.6549683,1.0000000,,,,0.00074619997758418,
ADGFAGVFPEHKYEIVKK,ac,K,569,false,"Quantitative Acetylproteomics",101,29440448,,,,,,,,
ADGFAGVFPEHKYEIVK,ac,K,569,false,"Histone deacetylases substrates - hda14 vs WT",98e,29061669,"MaxQuant Score",46.2000000,1.0000000,-0.4210000,0.8375293,NO,0.00098000001162291,
ADGFAGVFPEHKYEIVK,ac,K,569,false,"Quantitative Acetylproteomics",101,29440448,,,,,,,,
HIVGMTGDGVNDAPALKK,ac,K,597,false,"Quantitative Acetylproteomics",101,29440448,,,,,,,,
EAQWAQAQRTLHGLQPKEDVNIFPEK,ph,T,881,true,"Phosphoproteome ethylene-regulated time response",46,24043427,"MASCOT Score",65.5700000,,,,,,-4.8925000
EAQWAQAQRTLHGLQPK,ph,T,881,true,"STN8 phosphoproteome",38,21768351,"MASCOT Score",46.1600000,,,,,,1.8229300
EAQWAQAQRTLHGLQPK,ph,T,881,true,"Phosphoproteome ethylene-regulated time response",46,24043427,"MASCOT Score",66.1500000,,,,,,-4.7688000
EAQWAQAQRTLHGLQPK,ph,T,881,true,"Chloroplast kinase substrates",60,19376835,"MASCOT Score",35.1100000,,,,,,1.8229300
EAQWAQAQRTLHGLQPK,ph,T,881,true,"TOR Kinase and ABA Receptor",100,29290610,XCorr,2.9399369,1.0000000,,,,0.0012390000047162,
TLHGLQPKEDVNIFPEK,ph,T,881,true,"Phosphoproteome ethylene-regulated time response",46,24043427,"MASCOT Score",53.6800000,,,,,,-1.4323000
TLHGLQPK,ph,T,881,false,"Arabidopsis root NAA phosphoproteome",18a,27643528,"MaxQuant Score",54.5390000,1.0000000,,,,0.0020000000949949,-0.6290000
TLHGLQPK,ph,T,881,false,"Phosphorylation Early Elicitor Signaling",23,17317660,,,,,,,,
TLHGLQPK,ph,T,881,false,"Sucrose-induced phosphorylation",24,17586839,,,,,,,,
TLHGLQPK,ph,T,881,false,"Plasmembrane Ph Immune Responses",25,17651370,,,,,,,,
TLHGLQPK,ph,T,881,false,"Phosphoproteome ethylene-regulated time response",46,24043427,"MASCOT Score",49.4600000,,,,,,1.8147000
TLHGLQPK,ph,T,881,false,"Phosphorylation in N starvation",63,22060019,"MASCOT Score",34.0000000,,,,,,-1.6556100
TLHGLQPK,ph,T,881,false,"srk2dei ABA signaling phopshoproteomics",83,23572148,"MASCOT Score",32.0000000,,,,,,0.0005000
TLHGLQPK,ph,T,881,false,"atm and atr DNA damage response",88,25561503,"MASCOT Score",30.0000000,1.0000000,,,,,-2.1400000
TLHGLQPK,ph,T,881,false,"Lateral root-induction - NAA vs control",106,23328941,"MASCOT Score",21.0000000,,,,,,
TLHGLQPK,ph,T,881,false,"Phospho cell culture sucrose/TOR",109,30833711,,,1.0000000,,,,,
TLHGLQPK,ph,T,881,false,"Tissue atlas Arabidopsis - ProteomicsDB",114,32188942,"MaxQuant score",224.8000000,1.0000000,,,,0,
TLHGLQPKEDVNIFPEK,ub,K,888,true,"upl3 mutant / wildtype",168,35926874,"MaxQuant score",124.9100000,1.0000000,0.5139960,0.1177800,NO,4.472739956185E-10,1.0539000
EDVNIFPEKGSYR,ub,K,897,true,"upl3 mutant / wildtype",168,35926874,"MaxQuant score",136.2400000,1.0000000,0.7527486,,,4.0241499021931E-9,1.0755000
GSYRELSEIAEQAK,ph,S,899,false,"Tyrosine phosphorylation in Arabidopsis",59,18463617,"MASCOT Score",36.0000000,,,,,,-2.4100066
GSYRELSEIAEQAK,ph,S,899,false,"Brassinosteroid-Regulated Phosphorylation Dynamics",94,26187819,"MaxQuant Score",86.4530000,0.9850000,,,,0.017000000923872,-3.1700000
EDVNIFPEKGSYR,ph,S,899,true,"Plasmamembrane phosphorylation",20,15308754,,,,,,,,
EDVNIFPEKGSYR,ph,S,899,true,"Plasmembrane Ph Immune Responses",25,17651370,,,,,,,,
EDVNIFPEKGSYR,ph,S,899,true,"Tyrosine phosphorylation in Arabidopsis",59,18463617,"MASCOT Score",34.0000000,,,,,,-0.6124759
EDVNIFPEKGSYR,ph,S,899,true,"atm and atr DNA damage response",88,25561503,"MASCOT Score",54.0000000,0.9500000,,,,,-0.1200000
EDVNIFPEKGSYR,ph,S,899,true,"Phosphorylation tonoplast membrane fraction",107,18686298,"MASCOT Score",42.0000000,,,,,,
EDVNIFPEKGSYR,ph,S,899,true,"Phospho cell culture sucrose/TOR",109,30833711,,,0.8986860,,,,,
EDVNIFPEKGSYR,ph,S,899,true,"Tissue atlas Arabidopsis - ProteomicsDB",114,32188942,"MaxQuant score",228.7600000,1.0000000,,,,0,
GSYRELSEIAEQAK,ph,Y,900,false,"Tyrosine phosphorylation in Arabidopsis",59,18463617,"MASCOT Score",32.0000000,,,,,,-0.0602500
GSYRELSEIAEQAK,ph,Y,900,false,"srk2dei ABA signaling phopshoproteomics",83,23572148,"MASCOT Score",38.0000000,,,,,,0.0000000
ELSEIAEQAKR,nt,E,902,false,"Metacaspase9 substrates - Col-0 / mc9",51a,23964026,"MASCOT Score",79.0000000,,2.5510219,,NO,,-1.4780613
ELSEIAEQAKR,nt,E,902,false,"Metacaspase9 substrates - 35S:MC9 / mc9",51b,23964026,"MASCOT Score",64.0000000,,1.8580621,,NO,,-0.6370545
GSYRELSEIAEQAK,ph,S,904,false,"TOR Kinase and ABA Receptor",100,29290610,XCorr,3.8963094,0.9988000,,,,0.0010560000082478,
ELSEIAEQAK,ph,S,904,false,"Plasmamembrane phosphorylation",20,15308754,,,,,,,,
ELSEIAEQAK,ph,S,904,false,"Phosphorylation Early Elicitor Signaling",23,17317660,,,,,,,,
ELSEIAEQAK,ph,S,904,false,"atm and atr DNA damage response",88,25561503,"MASCOT Score",58.0000000,1.0000000,,,,,-1.5600000
ELSEIAEQAK,ph,S,904,false,"Tissue atlas Arabidopsis - ProteomicsDB",114,32188942,"MaxQuant score",218.3600000,1.0000000,,,,4.9754300849605E-27,
ELSEIAEQAKR,ac,K,911,false,"Quantitative Acetylproteomics",101,29440448,,,,,,,,
GSYRELSEIAEQAKR,ub,K,911,false,"Ubiquitination Membrane Proteins",120,33585938,,,,,,,,
ELSEIAEQAKR,ub,K,911,false,"Arabidopsis ubiquitination COFRADIC",40,26744219,"MaxQuant Score",188.9900000,1.0000000,,,,0,0.3180000
ELSEIAEQAKR,ub,K,911,false,"Ubiquitination Membrane Proteins",120,33585938,,,,,,,,
ELSEIAEQAKR,ub,K,911,false,"upl3 mutant / wildtype",168,35926874,"MaxQuant score",157.3800000,1.0000000,-0.3510744,0.4761600,NO,1.5190000368648E-9,0.3089400
LRELHTLK,ph,T,924,false,"TOR Kinase and ABA Receptor",100,29290610,XCorr,2.9754255,1.0000000,,,,0.013799999840558,
LRELHTLK,ph,T,924,false,"Tissue atlas Arabidopsis - ProteomicsDB",114,32188942,"MaxQuant score",96.7450000,1.0000000,,,,8.6063802882563E-5,
LRELHTLKGHVESVAK,ub,K,926,true,"Ubiquitination Membrane Proteins",120,33585938,,,,,,,,
ELHTLKGHVESVAK,ub,K,926,true,"upl3 mutant / wildtype",168,35926874,"MaxQuant score",64.7980000,1.0000000,0.0881416,,,0.00038590200711042,1.3190000
GHVESVAK,ph,S,931,true,"Plasmembrane Ph Immune Responses",25,17651370,,,,,,,,
GHVESVAK,ph,S,931,true,"atm and atr DNA damage response",88,25561503,"MASCOT Score",35.0000000,1.0000000,,,,,-1.7400000
GHVESVAK,ph,S,931,true,"Tissue atlas Arabidopsis - ProteomicsDB",114,32188942,"MaxQuant score",130.4100000,1.0000000,,,,0.0026800699997693,
GHVESVAKLK,ac,K,934,true,"Quantitative Acetylproteomics",101,29440448,,,,,,,,
GHVESVAKLK,ub,K,934,true,"Ubiquitination Membrane Proteins",120,33585938,,,,,,,,
GHVESVAKLK,ub,K,934,true,"upl3 mutant / wildtype",168,35926874,"MaxQuant score",125.7400000,1.0000000,0.2116353,0.8653400,NO,4.5386401325231E-5,0.0999030
LKGLDIDTAGHHYTV,ub,K,936,true,"Ubiquitination Membrane Proteins",120,33585938,,,,,,,,
LKGLDIDTAGHHYTV,ub,K,936,true,"upl3 mutant / wildtype",168,35926874,"MaxQuant score",140.2700000,1.0000000,2.0932221,0.1954240,NO,3.718380117701E-11,-1.5555000
GLDIDTAGHHYTV,ph,T,942,true,"Tyrosine phosphorylation in Arabidopsis",59,18463617,"MASCOT Score",21.0000000,,,,,,-1.8272616
GLDIDTAGHHYTV,ph,T,942,true,"Lateral root-induction - NAA vs control",106,23328941,"MASCOT Score",21.0000000,,,,,,
GLDIDTAGHHYTV,ph,T,942,true,"Tissue atlas Arabidopsis - ProteomicsDB",114,32188942,"MaxQuant score",176.6100000,1.0000000,,,,1.989300075307E-15,
GLDIDTAGHHYTV,ph,Y,947,true,"Phosphoproteome iron-deficient Arabidopsis roots",41,22438062,"MASCOT Score",41.8600000,,,,,,
LKGLDIDTAGHHYTV,ph,T,948,true,"STN8 phosphoproteome",38,21768351,"MASCOT Score",43.7000000,,,,,,0.2068080
LKGLDIDTAGHHYTV,ph,T,948,true,"MAPK Arabidopsis substrates",45,23172892,"MaxQuant Score",176.8700000,,,,,,
LKGLDIDTAGHHYTV,ph,T,948,true,"Phosphoproteome ethylene-regulated time response",46,24043427,"MASCOT Score",91.0900000,,,,,,-10.3236000
LKGLDIDTAGHHYTV,ph,T,948,true,"Chloroplast kinase substrates",60,19376835,"MASCOT Score",46.0200000,,,,,,-0.7091880
LKGLDIDTAGHHYTV,ph,T,948,true,"SnRK2 protein kinase substrates",85,23776212,XCorr,2.4160838,0.9490000,,,,7.9028001920278E-9,
LKGLDIDTAGHHYTV,ph,T,948,true,"Tissue atlas Arabidopsis - ProteomicsDB",114,32188942,"MaxQuant score",313.8700000,1.0000000,,,,0,
LKGLDIDTAGHHYTV,ph,T,948,true,"Touch-induced phosphorylation: 40s touch vs untouc",136,30291188,"MASCOT score",68.7500000,,0.0347991,0.7472288,NO,,7.1325386
GLDIDTAGHHYTV,ph,T,948,true,"Arabidopsis root NAA phosphoproteome",18a,27643528,"MaxQuant Score",118.5200000,1.0000000,,,,2.036000014416E-11,0.1010000
GLDIDTAGHHYTV,ph,T,948,true,"Plasmamembrane phosphorylation",20,15308754,,,,,,,,
GLDIDTAGHHYTV,ph,T,948,true,"Sucrose-induced phosphorylation",24,17586839,,,,,,,,
GLDIDTAGHHYTV,ph,T,948,true,"Plasmembrane Ph Immune Responses",25,17651370,,,,,,,,
GLDIDTAGHHYTV,ph,T,948,true,"Phosphorylation nuclei-enriched fractions",28,19245862,,,,,,,,
GLDIDTAGHHYTV,ph,T,948,true,"Mitochondrial phosphoproteome",32,19688752,"MASCOT Score",41.0500000,,,,,,4.1935000
GLDIDTAGHHYTV,ph,T,948,true,"Phytohormone-responsive phosphoproteins",34,20374526,"MASCOT Score",40.0000000,,,,,,-1.0593000
GLDIDTAGHHYTV,ph,T,948,true,"STN8 phosphoproteome",38,21768351,"MASCOT Score",49.8700000,,,,,,-0.4510440
GLDIDTAGHHYTV,ph,T,948,true,"Phosphoproteome ethylene-regulated time response",46,24043427,"MASCOT Score",57.5700000,,,,,,-9.4327000
GLDIDTAGHHYTV,ph,T,948,true,"Tyrosine phosphorylation in Arabidopsis",59,18463617,"MASCOT Score",29.0000000,,,,,,-1.0828207
GLDIDTAGHHYTV,ph,T,948,true,"Chloroplast kinase substrates",60,19376835,"MASCOT Score",52.1100000,,,,,,-0.6537960
GLDIDTAGHHYTV,ph,T,948,true,"BSK8 and BSL2 regulating sucrose-ph synthase",66,24924143,"MaxQuant Score",185.9500000,,,,,,0.8644400
GLDIDTAGHHYTV,ph,T,948,true,"srk2dei ABA signaling phopshoproteomics",83,23572148,"MASCOT Score",47.0000000,,,,,,-0.0001000
GLDIDTAGHHYTV,ph,T,948,true,"LAXIC - ABA stress",84a,23660473,XCorr,2.8200000,0.9950000,,,,0.11014699935913,
GLDIDTAGHHYTV,ph,T,948,true,"SnRK2 protein kinase substrates",85,23776212,XCorr,2.5929928,0.9720000,,,,7.901149956524E-8,
GLDIDTAGHHYTV,ph,T,948,true,"SIRK1 phosphorylation",86a,23820729,"MaxQuant Score",104.3800000,1.0000000,,,,0.11900000274181,8.3330000
GLDIDTAGHHYTV,ph,T,948,true,"SIRK1 exp - sirk1 mutant vs WT",86b,23820729,,,,-0.9506946,,NO,,
GLDIDTAGHHYTV,ph,T,948,true,"SIRK1 exp - 35S:SIRK1 vs WT",86c,23820729,,,,-1.6801470,,NO,,
GLDIDTAGHHYTV,ph,T,948,true,"atm and atr DNA damage response",88,25561503,"MASCOT Score",52.0000000,0.9970000,,,,,-0.1100000
GLDIDTAGHHYTV,ph,T,948,true,"Brassinosteroid-Regulated Phosphorylation Dynamics",94,26187819,"MaxQuant Score",173.6800000,1.0000000,,,,9.9960000947569E-22,1.9710000
GLDIDTAGHHYTV,ph,T,948,true,"TOR Kinase and ABA Receptor",100,29290610,XCorr,4.0557985,0.9993000,,,,0.00016409999807365,
GLDIDTAGHHYTV,ph,T,948,true,"Lateral root-induction - NAA vs control",106,23328941,"MASCOT Score",26.0000000,,,,,,
GLDIDTAGHHYTV,ph,T,948,true,"Phosphorylation tonoplast membrane fraction",107,18686298,"MASCOT Score",35.0000000,,,,,,
GLDIDTAGHHYTV,ph,T,948,true,"Phospho cell culture sucrose/TOR",109,30833711,,,1.0000000,,,,,
GLDIDTAGHHYTV,ph,T,948,true,"Col-0 callus - FC Col-0 vs. Col-0 Xray",111a,31410901,,47.5300000,,-0.2526602,0.0000000,NO,,0.6380218
GLDIDTAGHHYTV,ph,T,948,true,"Col-0 X-ray callus - FC Col-0 vs. Col-0 Xray",111b,31410901,,47.5300000,,-0.2526602,0.0000000,NO,,0.6380218
GLDIDTAGHHYTV,ph,T,948,true,"atm callus - FC atm vs. atm Xray",111c,31410901,,47.5300000,,0.2832120,0.0000000,NO,,0.6380218
GLDIDTAGHHYTV,ph,T,948,true,"atm-3 X-ray callus - FC atm vs. atm Xray",111d,31410901,,47.5300000,,0.2832120,0.0000000,NO,,0.6380218
GLDIDTAGHHYTV,ph,T,948,true,"Touch-induced phosphorylation: 40s touch vs untouc",136,30291188,"MASCOT score",81.0800000,,0.0067267,0.9378321,NO,,-0.3122405
