Peptide,PTM,ModifiedAA,ModifiedPosition,PeptideUniqueToGene,ExperimentDesc,ExpID,PubmedID,ScoreType,IdentScore,LocProb,Log2FChange,PQ-val,QuantSig,PEP,MassErrorPPM
VSGVGGSGGGR,nt,V,2,true,"Arg/N-end rule seed, prt6 vs. Wt",99,29168982,"MASCOT Score",75.2100000,,-0.2953207,0.0205067,NO,0.0012120000319555,0.0058683
VSGVGGSGGGR,nt,V,2,true,"Arabidopsis translation initiation landscape - NT",167b,35069635,,,,,,,,
VSGVGGSGGGR,ph,S,3,true,"atm and atr DNA damage response",88,25561503,"MASCOT Score",53.0000000,1.0000000,,,,,-0.0700000
VSGVGGSGGGR,ph,S,3,true,"Tissue atlas Arabidopsis - ProteomicsDB",114,32188942,"MaxQuant score",59.6700000,0.9998560,,,,0.0092581799253821,
VSGVGGSGGGR,ph,S,8,true,"atm and atr DNA damage response",88,25561503,"MASCOT Score",58.0000000,1.0000000,,,,,-0.6000000
GGEEEPSSSHTPNNR,ph,S,24,true,"atm and atr DNA damage response",88,25561503,"MASCOT Score",24.0000000,0.8440000,,,,,1.0800000
GGEEEPSSSHTPNNR,ph,S,24,true,"Tissue atlas Arabidopsis - ProteomicsDB",114,32188942,"MaxQuant score",82.8650000,0.7650670,,,,5.4112500947667E-5,
GGEEEPSSSHTPNNR,ph,S,25,true,"atm and atr DNA damage response",88,25561503,"MASCOT Score",42.0000000,0.8750000,,,,,0.4000000
GGEEEPSSSHTPNNR,ph,S,25,true,"Tissue atlas Arabidopsis - ProteomicsDB",114,32188942,"MaxQuant score",170.3500000,0.9444890,,,,8.1191300911489E-18,
GGEEEPSSSHTPNNR,ph,T,27,true,"atm and atr DNA damage response",88,25561503,"MASCOT Score",24.0000000,0.9990000,,,,,1.0800000
GGEEEPSSSHTPNNR,ph,T,27,true,"Tissue atlas Arabidopsis - ProteomicsDB",114,32188942,"MaxQuant score",176.6900000,0.9988440,,,,5.3806201501044E-19,
RGGEQAQSSGTK,ph,S,39,true,"atm and atr DNA damage response",88,25561503,"MASCOT Score",35.0000000,0.9250000,,,,,0.7000000
RGGEQAQSSGTK,ph,S,40,true,"atm and atr DNA damage response",88,25561503,"MASCOT Score",22.0000000,0.9940000,,,,,-1.6300000
RGGEQAQSSGTKSLRPR,ac,K,43,true,"Quantitative Acetylproteomics",101,29440448,,,,,,,,
GGEQAQSSGTKSLRPR,ac,K,43,true,"Quantitative Acetylproteomics",101,29440448,,,,,,,,
AIQQYTVDAR,ph,T,62,false,"Tissue atlas Arabidopsis - ProteomicsDB",114,32188942,"MaxQuant score",155.4800000,1.0000000,,,,1.8407999959891E-6,
LHAVFEQSGESGK,ph,S,74,false,"atm and atr DNA damage response",88,25561503,"MASCOT Score",25.0000000,0.9940000,,,,,0.1000000
LHAVFEQSGESGK,ph,S,74,false,"Tissue atlas Arabidopsis - ProteomicsDB",114,32188942,"MaxQuant score",135.8600000,1.0000000,,,,4.8564601229373E-9,
LHAVFEQSGESGK,ph,S,77,false,"Tissue atlas Arabidopsis - ProteomicsDB",114,32188942,"MaxQuant score",89.4710000,1.0000000,,,,9.4740499889667E-7,
SFDYSQSLK,ph,S,84,false,"Tissue atlas Arabidopsis - ProteomicsDB",114,32188942,"MaxQuant score",72.6520000,0.9743470,,,,0.0073896101675928,
SFDYSQSLK,ph,S,86,false,"srk2dei ABA signaling phopshoproteomics",83,23572148,"MASCOT Score",29.0000000,,,,,,0.0006000
SFDYSQSLK,ph,S,86,false,"atm and atr DNA damage response",88,25561503,"MASCOT Score",30.0000000,0.9950000,,,,,0.0900000
SFDYSQSLK,ph,S,86,false,"Tissue atlas Arabidopsis - ProteomicsDB",114,32188942,"MaxQuant score",178.1000000,0.9999940,,,,1.2535000450953E-6,
DSFKESEAAMNSK,ph,S,621,true,"Tissue atlas Arabidopsis - ProteomicsDB",114,32188942,"MaxQuant score",129.6500000,1.0000000,,,,7.5948701123707E-6,
VVDGVVQPCR,ox,C,637,true,"OxiTRAQ Arabidopsis - 5 mM H2O2 versus control",47,24376095,,,,0.9281657,0.0216558,YES,,
KRPLSTASGSGDMMLMMPY,ph,S,1161,true,"Tissue atlas Arabidopsis - ProteomicsDB",114,32188942,"MaxQuant score",141.1300000,0.7861050,,,,1.2778900201606E-16,
KRPLSTASGSGDMMLMMPY,ph,S,1163,true,"atm and atr DNA damage response",88,25561503,"MASCOT Score",28.0000000,0.9990000,,,,,0.3100000
KRPLSTASGSGDMMLMMPY,ph,S,1163,true,"Tissue atlas Arabidopsis - ProteomicsDB",114,32188942,"MaxQuant score",128.9800000,0.9670480,,,,1.8942100390659E-15,
