Peptide,PTM,ModifiedAA,ModifiedPosition,PeptideUniqueToGene,ExperimentDesc,ExpID,PubmedID,ScoreType,IdentScore,LocProb,Log2FChange,PQ-val,QuantSig,PEP,MassErrorPPM
TTRIAPGVGANLLGQHSAE,nt,T,2,true,"Arg/N-end rule seed, prt6 vs. Wt",99,29168982,"MASCOT Score",31.1600000,,,,,0.00018360000103712,-7.1524941
TTRIAPGVGANLLGQHSAERNQDATVY,nta,T,2,true,"Arabidopsis translation initiation landscape - NTA",167a,35069635,,,,,,,,
TTRIAPGVGANLLGQHSAE,nta,T,2,true,"Arg/N-end rule seed, prt6 vs. Wt",99,29168982,"MASCOT Score",31.1600000,,,,,0.00018360000103712,-7.1524941
TTRIAPGVGANLLGQHSAE,nta,T,2,true,"HUNTER N-terminome: legumain, GluC and trypsin",119,31951383,"MaxQuant score",113.1700000,,,,,,
IAPGVGANLLGQHSAER,ph,S,18,true,"atm and atr DNA damage response",88,25561503,"MASCOT Score",42.0000000,1.0000000,,,,,-0.3700000
IAPGVGANLLGQHSAER,ph,S,18,true,"Tissue atlas Arabidopsis - ProteomicsDB",114,32188942,"MaxQuant score",141.4500000,1.0000000,,,,1.6103299249615E-11,
LLAATNPTAQK,ph,T,210,true,"Phosphorylation in N starvation",63,22060019,"MASCOT Score",21.0000000,,,,,,-4.9390300
SMPPPPPHQG,nt,S,354,true,"Arabidopsis translation initiation landscape - NT",167b,35069635,,,,,,,,
