Peptide,PTM,ModifiedAA,ModifiedPosition,PeptideUniqueToGene,ExperimentDesc,ExpID,PubmedID,ScoreType,IdentScore,LocProb,Log2FChange,PQ-val,QuantSig,PEP,MassErrorPPM
AEIKDEGSAKGY,nt,A,2,true,"Arg/N-end rule seed, prt6 vs. Wt",99,29168982,"MASCOT Score",38.0400000,,,,,0.0022879999596626,-0.9922631
AEIKDEGSAKGYAFPLR,nta,A,2,true,"HUNTER N-terminome: legumain, GluC and trypsin",119,31951383,"MaxQuant score",49.5590000,,,,,,
AEIKDEGSAKGYAFPLR,nta,A,2,true,"Arabidopsis translation initiation landscape - NTA",167a,35069635,,,,,,,,
AEIKDEGSAKGY,nta,A,2,true,"Arg/N-end rule pathway Roots",80,25728785,"MASCOT Score",38.9900000,,,,,0.0023000000510365,
AEIKDEGSAKGY,nta,A,2,true,"Arg/N-end rule seed, prt6 vs. Wt",99,29168982,"MASCOT Score",38.0400000,,-0.1620558,0.1799198,NO,0.0022879999596626,-0.9922631
AEIKDEGSAKGYAFPLR,ph,S,9,true,"Tissue atlas Arabidopsis - ProteomicsDB",114,32188942,"MaxQuant score",187.6200000,1.0000000,,,,6.7327702657841E-13,
AEIKDEGSAK,ph,S,9,true,"atm and atr DNA damage response",88,25561503,"MASCOT Score",38.0000000,1.0000000,,,,,-1.8100000
AEIKDEGSAK,ph,S,9,true,"Protein sumoylation and phosphorylation cross-talk",97,28419593,,,,,,,,
AEIKDEGSAK,ph,S,9,true,"Phospho cell culture sucrose/TOR",109,30833711,,,1.0000000,,,,,
AEIKDEGSAKGYAFPLR,ub,K,11,true,"upl3 mutant / wildtype",168,35926874,"MaxQuant score",61.2650000,0.9970000,2.5102024,,,0.00028750000637956,0.7477600
GYAFPLRNPNVTLNER,ph,T,23,true,"TOR Kinase and ABA Receptor",100,29290610,XCorr,3.6439943,1.0000000,,,,0.0034209999721497,
NPNVTLNER,ph,T,23,true,"Tissue atlas Arabidopsis - ProteomicsDB",114,32188942,"MaxQuant score",93.8390000,1.0000000,,,,0.00019850599346682,
IIAVCADDPEFR,acy,C,148,true,"Arabidopsis S-acylation atlas - Meristem",163a,35681017,,,,,,,,
RFFEDYKK,ac,K,179,false,"Quantitative Acetylproteomics",101,29440448,,,,,,,,
DSMDLYAAYIK,mox,M,205,true,"cat2 Methionine oxidation - 1h stress",62a,25693801,"MASCOT Score",43.0000000,,0.6596756,,NO,,
