Peptide,PTM,ModifiedAA,ModifiedPosition,PeptideUniqueToGene,ExperimentDesc,ExpID,PubmedID,ScoreType,IdentScore,LocProb,Log2FChange,PQ-val,QuantSig,PEP,MassErrorPPM
FDATEIEDDADVEPDTDLEDTEKEGDDEATKMEIAK,ph,T,102,true,"Tissue atlas Arabidopsis - ProteomicsDB",114,32188942,"MaxQuant score",271.2700000,0.9997020,,,,0,
FDATEIEDDADVEPDTDLEDTEKEGDDEATK,ph,T,102,true,"Col-0 callus - FC Col-0 vs. Col-0 Xray",111a,31410901,,32.2200000,,-0.2613655,0.0000000,NO,,1.4873617
FDATEIEDDADVEPDTDLEDTEKEGDDEATK,ph,T,102,true,"Col-0 X-ray callus - FC Col-0 vs. Col-0 Xray",111b,31410901,,32.2200000,,-0.2613655,0.0000000,NO,,1.4873617
FDATEIEDDADVEPDTDLEDTEKEGDDEATK,ph,T,102,true,"atm callus - FC atm vs. atm Xray",111c,31410901,,32.2200000,,0.2808116,0.0000000,NO,,1.4873617
FDATEIEDDADVEPDTDLEDTEKEGDDEATK,ph,T,102,true,"atm-3 X-ray callus - FC atm vs. atm Xray",111d,31410901,,32.2200000,,0.2808116,0.0000000,NO,,1.4873617
FDATEIEDDADVEPDTDLEDTEK,ph,T,102,true,"TOR Kinase and ABA Receptor",100,29290610,XCorr,5.3302746,1.0000000,,,,1.8759999420581E-7,
NAPSSDDEDDEDRMEK,ph,S,635,true,"SnRK2 protein kinase substrates",85,23776212,XCorr,4.3112597,0.9620000,,,,0.00016489399422426,
NAPSSDDEDDEDRMEK,ph,S,635,true,"atm and atr DNA damage response",88,25561503,"MASCOT Score",30.0000000,1.0000000,,,,,-0.5600000
NAPSSDDEDDEDRMEK,ph,S,635,true,"Brassinosteroid-Regulated Phosphorylation Dynamics",94,26187819,"MaxQuant Score",190.8000000,1.0000000,,,,7.863999809816E-35,0.8900000
NAPSSDDEDDEDRMEK,ph,S,635,true,"TOR Kinase and ABA Receptor",100,29290610,XCorr,3.8824506,1.0000000,,,,9.8489999800222E-6,
NAPSSDDEDDEDR,ph,S,635,true,"atm and atr DNA damage response",88,25561503,"MASCOT Score",79.0000000,1.0000000,,,,,-0.0200000
NAPSSDDEDDEDRMEK,ph,S,636,true,"atm and atr DNA damage response",88,25561503,"MASCOT Score",38.0000000,0.9950000,,,,,0.0200000
NAPSSDDEDDEDRMEK,ph,S,636,true,"Brassinosteroid-Regulated Phosphorylation Dynamics",94,26187819,"MaxQuant Score",190.8000000,1.0000000,,,,7.863999809816E-35,0.8900000
NAPSSDDEDDEDRMEK,ph,S,636,true,"TOR Kinase and ABA Receptor",100,29290610,XCorr,3.8824506,1.0000000,,,,9.8489999800222E-6,
NAPSSDDEDDEDRMEK,ph,S,636,true,"Tissue atlas Arabidopsis - ProteomicsDB",114,32188942,"MaxQuant score",219.2300000,1.0000000,,,,0,
NAPSSDDEDDEDR,ph,S,636,true,"atm and atr DNA damage response",88,25561503,"MASCOT Score",79.0000000,1.0000000,,,,,-0.0200000
