Peptide,PTM,ModifiedAA,ModifiedPosition,PeptideUniqueToGene,ExperimentDesc,ExpID,PubmedID,ScoreType,IdentScore,LocProb,Log2FChange,PQ-val,QuantSig,PEP,MassErrorPPM
KGPAKFR,ub,K,24,false,"Arabidopsis ubiquitination COFRADIC",40,26744219,"MaxQuant Score",60.7600000,1.0000000,,,,0.024000000208616,0.0750000
KGPAKFR,ub,K,28,false,"Arabidopsis ubiquitination COFRADIC",40,26744219,"MaxQuant Score",97.6020000,1.0000000,,,,0.0060000000521541,1.4110000
SLDFGER,nt,S,31,false,"Arabidopsis translation initiation landscape - NT",167b,35069635,,,,,,,,
FRSLDFGER,ph,S,31,false,"Arabidopsis root NAA phosphoproteome",18a,27643528,"MaxQuant Score",51.2860000,1.0000000,,,,0.0020000000949949,0.1370000
FRSLDFGER,ph,S,31,false,"Tyrosine phosphorylation in Arabidopsis",59,18463617,"MASCOT Score",28.0000000,,,,,,-0.6636128
FRSLDFGER,ph,S,31,false,"srk2dei ABA signaling phopshoproteomics",83,23572148,"MASCOT Score",45.0000000,,,,,,-0.0004000
FRSLDFGER,ph,S,31,false,"SnRK2 protein kinase substrates",85,23776212,XCorr,2.1811745,1.0000000,,,,0.00021210899285506,
FRSLDFGER,ph,S,31,false,"atm and atr DNA damage response",88,25561503,"MASCOT Score",24.0000000,1.0000000,,,,,-0.7600000
FRSLDFGER,ph,S,31,false,"TOR Kinase and ABA Receptor",100,29290610,XCorr,3.2152212,1.0000000,,,,0.0032110000029206,
FRSLDFGER,ph,S,31,false,"Phospho cell culture sucrose/TOR",109,30833711,,,1.0000000,,,,,
FRSLDFGER,ph,S,31,false,"Tissue atlas Arabidopsis - ProteomicsDB",114,32188942,"MaxQuant score",108.5300000,1.0000000,,,,0.00027047700132243,
DFGERNGYLKGVVTEIIH,nt,D,33,false,"Arabidopsis translation initiation landscape - NT",167b,35069635,,,,,,,,
NGYLKGVVTEIIHDPGR,nt,N,38,false,"Arabidopsis translation initiation landscape - NT",167b,35069635,,,,,,,,
GVVTEIIHDPGR,nt,G,43,false,"Arg/N-end rule seed, prt6 vs. Wt",99,29168982,"MASCOT Score",39.7300000,,-0.1779482,0.2988796,NO,0.034779999405146,0.0095052
TLVVGNVLPLR,nt,T,95,false,"Arg/N-end rule pathway Roots",80,25728785,"MASCOT Score",47.8600000,,,,,0.005994999781251,
SIPEGAVVCNVEHHVGDR,nt,S,106,true,"Arabidopsis translation initiation landscape - NT",167b,35069635,,,,,,,,
SIPEGAVVCNVEHHVGDR,sno,C,114,true,"hot5-4 / wildtype, FAT-switch S-nitrosoproteome",169,37277371,,,,0.1325100,0.1655619,NO,,
SIPEGAVVCNVEHHVGDRGVLAR,so,C,114,true,"S-sulfenylation site detection using YAP1C",110,32714340,,,,,,,,
SIPEGAVVCNVEHHVGDR,so,C,114,true,"Arabidopsis S-sulfenylation chemoproteomics",108,31578252,"pFind PSM Score",0.1190320,,,,,,0.2694192
NVEHHVGDR,nt,N,115,false,"Arg/N-end rule seed, prt6 vs. Wt",99,29168982,"MASCOT Score",49.9200000,,-0.2042121,0.2987000,NO,0.015699999406934,-0.4709468
ASGDYAIVIAHNPDSDTTR,nt,A,129,true,"Arabidopsis translation initiation landscape - NT",167b,35069635,,,,,,,,
IVIAHNPDSDTTR,nt,I,135,true,"Arg/N-end rule seed, prt6 vs. Wt",99,29168982,"MASCOT Score",32.0300000,,-0.5025741,0.4384626,NO,0.098070003092289,-0.7076956
ASGDYAIVIAHNPDSDTTR,ph,S,143,true,"atm and atr DNA damage response",88,25561503,"MASCOT Score",35.0000000,0.9960000,,,,,-0.7500000
IKLPSGSKK,ac,K,155,false,"Quantitative Acetylproteomics",101,29440448,,,,,,,,
KIVPSGCR,ox,C,162,false,"OxiTRAQ Arabidopsis - 5 mM H2O2 versus control",47,24376095,,,,-0.0497293,0.5453780,NO,,
IVPSGCR,sno,C,162,false,"hot5-4 / wildtype, FAT-switch S-nitrosoproteome",169,37277371,,,,,,,,
IVPSGCR,so,C,162,false,"S-sulfenylation site detection using YAP1C",110,32714340,,,,,,,,
AMIGQVAGGGRTE,nt,A,164,false,"Arg/N-end rule seed, prt6 vs. Wt",99,29168982,"MASCOT Score",33.4500000,,0.1444476,0.7530477,NO,0.0011640000157058,-0.8364583
AMIGQVAGGGR,nt,A,164,false,"Arg/N-end rule pathway Roots",80,25728785,"MASCOT Score",39.4900000,,,,,0.014999999664724,
AMIGQVAGGGR,nt,A,164,false,"Arg/N-end rule seed, prt6 vs. Wt",99,29168982,"MASCOT Score",24.3300000,,-0.0497440,0.8088644,NO,0.11779999732971,-1.5275297
AMIGQVAGGGR,nt,A,164,false,"Arabidopsis translation initiation landscape - NT",167b,35069635,,,,,,,,
AGNAYHKYR,nt,A,182,false,"Arabidopsis translation initiation landscape - NT",167b,35069635,,,,,,,,
AGNAYHKYR,ac,K,188,false,"Quantitative Acetylproteomics",101,29440448,,,,,,,,
DAPPGQKVGLIAAR,ub,K,234,true,"Arabidopsis ubiquitination COFRADIC",40,26744219,"MaxQuant Score",94.0230000,1.0000000,,,,1.6949999803728E-7,-0.5500000
LRGQAAASAAKAD,ac,K,256,true,"Quantitative Acetylproteomics",101,29440448,,,,,,,,
GQAAASAAKAD,ac,K,256,true,"Quantitative Acetylproteomics",101,29440448,,,,,,,,
GQAAASAAKAD,ub,K,256,true,"Arabidopsis ubiquitination COFRADIC",40,26744219,"MaxQuant Score",55.2580000,1.0000000,,,,0.016000000759959,-0.1700000
