Peptide,PTM,ModifiedAA,ModifiedPosition,PeptideUniqueToGene,ExperimentDesc,ExpID,PubmedID,ScoreType,IdentScore,LocProb,Log2FChange,PQ-val,QuantSig,PEP,MassErrorPPM
AMEDQSAARS,nt,A,2,true,"N-term acetylation drought responses",5,26184543,,,,,,,,
AMEDQSAAR,nt,A,2,true,"Arg/N-end rule seed, prt6 vs. Wt",99,29168982,"MASCOT Score",41.6000000,,,,,0.10840000212193,1.2252742
AMEDQSAARS,nta,A,2,true,"N-term acetylation drought responses",5,26184543,,,,,,,,
AMEDQSAAR,nta,A,2,true,"Characterization plant N-terminal acetylation",6,22223895,"MASCOT Score",61.1100000,,,,,,
AMEDQSAAR,nta,A,2,true,"Arg/N-end rule pathway Roots",80,25728785,"MASCOT Score",37.1500000,,,,,0.0023099998943508,
AMEDQSAAR,nta,A,2,true,"Arg/N-end rule seed, prt6 vs. Wt",99,29168982,"MASCOT Score",41.6000000,,,,,0.10840000212193,1.2252742
VSWFSDGK,ph,S,19,true,"atm and atr DNA damage response",88,25561503,"MASCOT Score",30.0000000,1.0000000,,,,,-1.9200000
VSWFSDGK,ph,S,19,true,"Tissue atlas Arabidopsis - ProteomicsDB",114,32188942,"MaxQuant score",134.8400000,1.0000000,,,,0.0026552099734545,
SLTLGESVEYEIALGSDGK,ph,S,65,true,"Tissue atlas Arabidopsis - ProteomicsDB",114,32188942,"MaxQuant score",193.2700000,1.0000000,,,,1.4012984643248E-45,
AIEVTAPGGGSLNKK,ph,S,81,true,"Tissue atlas Arabidopsis - ProteomicsDB",114,32188942,"MaxQuant score",112.5000000,0.9999960,,,,3.9104102143028E-6,
GSGGNCFNCGEVGHMAK,ph,S,92,true,"Tissue atlas Arabidopsis - ProteomicsDB",114,32188942,"MaxQuant score",172.2000000,1.0000000,,,,2.7862799413057E-22,
DCDGGSGGKSFGGGGGR,ph,S,113,true,"atm and atr DNA damage response",88,25561503,"MASCOT Score",34.0000000,1.0000000,,,,,0.0500000
DCDGGSGGK,ph,S,113,true,"atm and atr DNA damage response",88,25561503,"MASCOT Score",43.0000000,1.0000000,,,,,-1.4400000
DCDGGSGGKSFGGGGGR,ph,S,117,true,"atm and atr DNA damage response",88,25561503,"MASCOT Score",34.0000000,1.0000000,,,,,0.0500000
DCDGGSGGKSFGGGGGR,ph,S,117,true,"Tissue atlas Arabidopsis - ProteomicsDB",114,32188942,"MaxQuant score",70.6990000,1.0000000,,,,0.00015214299492072,
SGGEGECYMCGDVGHFAR,nt,S,126,true,"Arabidopsis translation initiation landscape - NT",167b,35069635,,,,,,,,
SGGEGECYMCGDVGHFAR,ph,S,126,true,"Tyrosine phosphorylation in Arabidopsis",59,18463617,"MASCOT Score",89.0000000,,,,,,-1.4508703
SGGEGECYMCGDVGHFAR,ph,S,126,true,"srk2dei ABA signaling phopshoproteomics",83,23572148,"MASCOT Score",61.0000000,,,,,,0.0002000
SGGEGECYMCGDVGHFAR,ph,S,126,true,"Lateral root-induction - NAA vs control",106,23328941,"MASCOT Score",40.0000000,,,,,,
QSGGGNSGGGGGGGRPCYSCGEVGHLAKDCR,nt,Q,147,true,"HUNTER N-terminome: legumain, GluC and trypsin",119,31951383,"MaxQuant score",63.7240000,,,,,,
QSGGGNSGGGGGGGRPCYSCGEVGHLAK,ph,S,148,true,"Tissue atlas Arabidopsis - ProteomicsDB",114,32188942,"MaxQuant score",44.2640000,0.7733160,,,,0.0008527819882147,
QSGGGNSGGGGGGGRPCYSCGEVGHLAK,ph,S,153,true,"Tissue atlas Arabidopsis - ProteomicsDB",114,32188942,"MaxQuant score",177.5400000,1.0000000,,,,0,
YGGGGGRGSGGDGCYMCGGVGHFAR,me1,R,191,true,"Arabidopsis protein methylome",123,31809900,"MaxQuant Score",154.8400000,1.0000000,,,,0,-1.0968000
YGGGGGRGSGGDGCYMCGGVGHFAR,me2,R,191,true,"Arabidopsis protein methylome",123,31809900,"MaxQuant Score",126.3200000,1.0000000,,,,1.5414283107573E-44,-0.5347800
GSGGDGCYMCGGVGHFAR,ph,S,193,true,"Tissue atlas Arabidopsis - ProteomicsDB",114,32188942,"MaxQuant score",135.3800000,1.0000000,,,,3.3397100917962E-15,
ACYECGGTGHLAR,nt,A,253,true,"Arabidopsis translation initiation landscape - NT",167b,35069635,,,,,,,,
ACYECGGTGHLAR,sno,C,254,true,"Site-specific nitrosomeproteomic id - gsnor1-3",90a,25699590,XCorr,2.4391766,,,,,0.09408999979496,-7.0332512
ACYECGGTGHLAR,sno,C,254,true,"Site-specific nitrosomeproteomic id - gsnor1-3",90b,25699590,XCorr,3.2900000,,,,,0.044369999319315,-5.5100000
