Peptide,PTM,ModifiedAA,ModifiedPosition,PeptideUniqueToGene,ExperimentDesc,ExpID,PubmedID,ScoreType,IdentScore,LocProb,Log2FChange,PQ-val,QuantSig,PEP,MassErrorPPM
MESSGDKQTSSLYPTVDTSNPEAPINPSSSSSTN,nta,M,1,true,"HUNTER N-terminome: legumain, GluC and trypsin",119,31951383,"MaxQuant score",46.7720000,,,,,,
MESSGDKQTS,nta,M,1,true,"Arg/N-end rule seed, prt6 vs. Wt",99,29168982,"MASCOT Score",43.2000000,,-0.4584363,0.5501273,NO,0.024269999936223,-1.4805930
EISHDSSDEEDGDGGKNTNEMLNYGLTIASK,ph,S,147,true,"Col-0 callus - FC Col-0 vs. Col-0 Xray",111a,31410901,,51.5300000,,2.0723855,0.0119054,YES,,0.9138394
EISHDSSDEEDGDGGKNTNEMLNYGLTIASK,ph,S,147,true,"Col-0 X-ray callus - FC Col-0 vs. Col-0 Xray",111b,31410901,,51.5300000,,2.0723855,0.0119054,YES,,0.9138394
EISHDSSDEEDGDGGKNTNEMLNYGLTIASK,ph,S,147,true,"atm callus - FC atm vs. atm Xray",111c,31410901,,51.5300000,,3.1063134,0.0198699,YES,,0.9138394
EISHDSSDEEDGDGGKNTNEMLNYGLTIASK,ph,S,147,true,"atm-3 X-ray callus - FC atm vs. atm Xray",111d,31410901,,51.5300000,,3.1063134,0.0198699,YES,,0.9138394
EISHDSSDEEDGDGGK,ph,S,147,true,"Tissue atlas Arabidopsis - ProteomicsDB",114,32188942,"MaxQuant score",69.7630000,0.8867550,,,,0.00013862800551578,
EISHDSSDEEDGDGGKNTNEMLNYGLTIASK,ph,S,150,true,"PAMP-triggered phosphorylation",48,24601666,"MASCOT Score",54.9800000,,,,,,
EISHDSSDEEDGDGGK,ph,S,150,true,"Large-scale phosphorylation discovery",44,23111157,XCorr,3.2170000,,,,,,
EISHDSSDEEDGDGGK,ph,S,150,true,"Chloroplast kinase substrates",60,19376835,"MASCOT Score",42.1900000,,,,,,-0.8676480
EISHDSSDEEDGDGGK,ph,S,150,true,"LAXIC - mannitol vs control",84b,23660473,XCorr,3.3700000,0.9990000,,,,6.1199998526718E-6,
EISHDSSDEEDGDGGK,ph,S,150,true,"SnRK2 protein kinase substrates",85,23776212,XCorr,2.8578260,0.9950000,,,,0.0040705599822104,
EISHDSSDEEDGDGGK,ph,S,150,true,"atm and atr DNA damage response",88,25561503,"MASCOT Score",70.0000000,0.9980000,,,,,0.1300000
EISHDSSDEEDGDGGK,ph,S,150,true,"Lateral root-induction - NAA vs control",106,23328941,"MASCOT Score",29.0000000,,,,,,
EISHDSSDEEDGDGGK,ph,S,150,true,"Tissue atlas Arabidopsis - ProteomicsDB",114,32188942,"MaxQuant score",375.4900000,0.9999990,,,,0,
EISHDSSDEEDGDGGKNTNEMLNYGLTIASK,ph,S,151,true,"PAMP-triggered phosphorylation",48,24601666,"MASCOT Score",54.9800000,,,,,,
EISHDSSDEEDGDGGKNTNEMLNYGLTIASK,ph,S,151,true,"SnRK2 protein kinase substrates",85,23776212,XCorr,3.4452889,0.7980000,,,,0.0097837802022696,
EISHDSSDEEDGDGGKNTNEMLNYGLTIASK,ph,S,151,true,"Col-0 callus - FC Col-0 vs. Col-0 Xray",111a,31410901,,51.5300000,,2.0723855,0.0119054,YES,,0.9138394
EISHDSSDEEDGDGGKNTNEMLNYGLTIASK,ph,S,151,true,"Col-0 X-ray callus - FC Col-0 vs. Col-0 Xray",111b,31410901,,51.5300000,,2.0723855,0.0119054,YES,,0.9138394
EISHDSSDEEDGDGGKNTNEMLNYGLTIASK,ph,S,151,true,"atm callus - FC atm vs. atm Xray",111c,31410901,,51.5300000,,3.1063134,0.0198699,YES,,0.9138394
EISHDSSDEEDGDGGKNTNEMLNYGLTIASK,ph,S,151,true,"atm-3 X-ray callus - FC atm vs. atm Xray",111d,31410901,,51.5300000,,3.1063134,0.0198699,YES,,0.9138394
EISHDSSDEEDGDGGK,ph,S,151,true,"Large-scale phosphorylation discovery",44,23111157,XCorr,2.8850000,,,,,,
EISHDSSDEEDGDGGK,ph,S,151,true,"Chloroplast kinase substrates",60,19376835,"MASCOT Score",42.1900000,,,,,,-0.8676480
EISHDSSDEEDGDGGK,ph,S,151,true,"LAXIC - mannitol vs control",84b,23660473,XCorr,3.3700000,1.0000000,,,,6.1199998526718E-6,
EISHDSSDEEDGDGGK,ph,S,151,true,"atm and atr DNA damage response",88,25561503,"MASCOT Score",61.0000000,0.9620000,,,,,-0.4100000
EISHDSSDEEDGDGGK,ph,S,151,true,"Lateral root-induction - NAA vs control",106,23328941,"MASCOT Score",29.0000000,,,,,,
EISHDSSDEEDGDGGK,ph,S,151,true,"Tissue atlas Arabidopsis - ProteomicsDB",114,32188942,"MaxQuant score",375.4900000,1.0000000,,,,0,
ETSPVELTGER,ph,S,220,true,"Tissue atlas Arabidopsis - ProteomicsDB",114,32188942,"MaxQuant score",56.5480000,0.9834600,,,,0.015601400285959,
ETSPVELTGERK,ph,T,225,true,"atm and atr DNA damage response",88,25561503,"MASCOT Score",34.0000000,1.0000000,,,,,-0.7800000
ETSPVELTGER,ph,T,225,true,"Tissue atlas Arabidopsis - ProteomicsDB",114,32188942,"MaxQuant score",104.9400000,1.0000000,,,,0.0001392179983668,
QCSAYWTTLAPNVEDYSGK,ox,C,236,true,"SPEAR - 10 mM H2O2 / mock",138a,34619326,,,,-2.3358843,0.0251101,YES,,
QCSAYWTTLAPNVEDYSGK,ph,S,237,true,"Tissue atlas Arabidopsis - ProteomicsDB",114,32188942,"MaxQuant score",132.8700000,0.9999990,,,,3.9565899994797E-15,
LIATGSGHLIK,ph,S,262,true,"Tissue atlas Arabidopsis - ProteomicsDB",114,32188942,"MaxQuant score",164.4800000,0.9988580,,,,4.5943301246743E-11,
GILWCGDVTMDR,so,C,272,true,"S-sulfenylation site detection using YAP1C",110,32714340,,,,,,,,
ESEVHPDTLKR,ac,K,306,true,"Quantitative Acetylproteomics",101,29440448,,,,,,,,
VCDAVEVAGR,sno,C,369,false,"hot5-4 / wildtype, FAT-switch S-nitrosoproteome",169,37277371,,,,,,,,
DAVEVAGR,nt,D,370,false,"Arg/N-end rule seed, prt6 vs. Wt",99,29168982,"MASCOT Score",36.2500000,,-0.7301293,0.0012705,NO,0.063989996910095,-0.0797608
NVMSTSSTVTTELVDHK,ph,S,384,true,"Tissue atlas Arabidopsis - ProteomicsDB",114,32188942,"MaxQuant score",195.4600000,0.8391350,,,,2.9885996816103E-39,
SVLKPSTLAK,ph,S,431,true,"Tissue atlas Arabidopsis - ProteomicsDB",114,32188942,"MaxQuant score",84.1690000,0.9999400,,,,0.0039273798465729,
