Peptide,PTM,ModifiedAA,ModifiedPosition,PeptideUniqueToGene,ExperimentDesc,ExpID,PubmedID,ScoreType,IdentScore,LocProb,Log2FChange,PQ-val,QuantSig,PEP,MassErrorPPM
LANEDQSLVTFSDGNETVR,ng,N,92,true,"Conserved N-glycosylation",74,22633491,"MaxQuant Score",160.1200000,1.0000000,,,,3.1139654474226E-41,2.2200000
APGGSSLDLNIYSPNASSTSTK,ng,N,157,true,"Conserved N-glycosylation",74,22633491,"MaxQuant Score",224.4800000,1.0000000,,,,0,1.2210000
VPCNSTLCTR,ng,N,168,true,"Conserved N-glycosylation",74,22633491,"MaxQuant Score",121.8500000,1.0000000,,,,6.9840001515331E-7,-0.4690000
YLSNGTSSTGVLVEDVLHLVSNDK,ng,N,194,true,"Conserved N-glycosylation",74,22633491,"MaxQuant Score",226.2000000,1.0000000,,,,0,-2.3130000
ETPLNIRQPHPTYNITVTK,ng,N,305,true,"N-Glycopeptide Profiling in Arabidopsis Infloresce",132,27067053,"MOWSE score",33.5000000,,,,,0.00078000000212342,
QPHPTYNITVTK,ng,N,305,true,"Conserved N-glycosylation",74,22633491,"MaxQuant Score",94.8340000,1.0000000,,,,0.00014200000441633,-0.3500000
QPHPTYNITVTK,ng,N,305,true,"UDP-GlcNAc transporter glycopeptide analysis",135,30224661,,,,,,,2.2291791538009E-5,0.6000000
DSFQYPAVNLTMK,ng,N,384,true,"Conserved N-glycosylation",74,22633491,"MaxQuant Score",130.6900000,1.0000000,,,,7.037999740292E-13,2.0220000
ESDCYTGETSAR,ox,C,449,true,"OxiTRAQ Arabidopsis - 5 mM H2O2 versus control",47,24376095,,,,-0.8648767,0.0673510,NO,,
