Peptide,PTM,ModifiedAA,ModifiedPosition,PeptideUniqueToGene,ExperimentDesc,ExpID,PubmedID,ScoreType,IdentScore,LocProb,Log2FChange,PQ-val,QuantSig,PEP,MassErrorPPM
TIKDESESCGSRAVVASPSQENPRHY,nt,T,2,true,"Arabidopsis translation initiation landscape - NT",167b,35069635,,,,,,,,
TIKDESESCGSRAVVASPSQEN,nt,T,2,true,"HUNTER N-terminome: legumain, GluC and trypsin",119,31951383,"MaxQuant score",115.4200000,,,,,,
TIKDESESCGSR,nt,T,2,true,"Arg/N-end rule pathway Roots",80,25728785,"MASCOT Score",34.3600000,,,,,0.0013379999436438,
TIKDESESCGSR,nt,T,2,true,"Arg/N-end rule seed, prt6 vs. Wt",99,29168982,"MASCOT Score",21.4400000,,-0.1729291,0.0885313,NO,0.0035210000351071,-1.0304017
TIKDESESCGSR,ph,T,2,true,"atm and atr DNA damage response",88,25561503,"MASCOT Score",24.0000000,1.0000000,,,,,-0.9100000
TIKDESESCGSR,ph,T,2,true,"Tissue atlas Arabidopsis - ProteomicsDB",114,32188942,"MaxQuant score",114.7000000,1.0000000,,,,0.00024930899962783,
TIKDESESCGSR,ph,S,7,true,"Tissue atlas Arabidopsis - ProteomicsDB",114,32188942,"MaxQuant score",187.1600000,0.9999790,,,,5.5002599349889E-20,
TIKDESESCGSR,ph,S,9,true,"Tissue atlas Arabidopsis - ProteomicsDB",114,32188942,"MaxQuant score",97.0930000,0.9856140,,,,8.7043699750211E-5,
TIKDESESCGSR,ph,S,12,true,"Tissue atlas Arabidopsis - ProteomicsDB",114,32188942,"MaxQuant score",79.8850000,0.9901800,,,,0.00052165001397952,
AVVASPSQENPR,ph,S,18,true,"SnRK2 protein kinase substrates",85,23776212,XCorr,2.3753414,0.9930000,,,,0.033068001270294,
AVVASPSQENPR,ph,S,18,true,"atm and atr DNA damage response",88,25561503,"MASCOT Score",53.0000000,1.0000000,,,,,-0.0400000
AVVASPSQENPR,ph,S,18,true,"TOR Kinase and ABA Receptor",100,29290610,XCorr,3.6792800,0.9935000,,,,0.00033069998607971,
AVVASPSQENPR,ph,S,18,true,"Lateral root-induction - NAA vs control",106,23328941,"MASCOT Score",33.0000000,,,,,,
AVVASPSQENPR,ph,S,18,true,"Phospho cell culture sucrose/TOR",109,30833711,,,0.9990360,,,,,
AVVASPSQENPR,ph,S,18,true,"Tissue atlas Arabidopsis - ProteomicsDB",114,32188942,"MaxQuant score",175.7400000,0.9999890,,,,2.6937398963305E-15,
AVVASPSQENPR,ph,S,20,true,"atm and atr DNA damage response",88,25561503,"MASCOT Score",43.0000000,1.0000000,,,,,-0.0500000
AVVASPSQENPR,ph,S,20,true,"Lateral root-induction - NAA vs control",106,23328941,"MASCOT Score",33.0000000,,,,,,
AVVASPSQENPR,ph,S,20,true,"Phospho cell culture sucrose/TOR",109,30833711,,,0.9721310,,,,,
AVVASPSQENPR,ph,S,20,true,"Tissue atlas Arabidopsis - ProteomicsDB",114,32188942,"MaxQuant score",160.5600000,0.9999700,,,,5.7708499090481E-10,
IVEDVDSVVNATLSTRPMHEITFSTIDKPK,ph,S,161,true,"Tissue atlas Arabidopsis - ProteomicsDB",114,32188942,"MaxQuant score",82.3170000,0.9846360,,,,1.1605300054285E-11,
QKSISFFEHDK,ph,S,251,true,"Tissue atlas Arabidopsis - ProteomicsDB",114,32188942,"MaxQuant score",110.9800000,0.9999510,,,,6.1679500504397E-5,
SISFFEHDK,ph,S,253,true,"srk2dei ABA signaling phopshoproteomics",83,23572148,"MASCOT Score",28.0000000,,,,,,-0.0003000
SISFFEHDK,ph,S,253,true,"Tissue atlas Arabidopsis - ProteomicsDB",114,32188942,"MaxQuant score",172.2700000,0.9999720,,,,5.0342798203928E-5,
GTYCSQEVAIK,so,C,306,false,"Arabidopsis S-sulfenylation chemoproteomics",108,31578252,"pFind PSM Score",0.0339827,,0.9523800,,,,0.3586551
VQIESGVMTAETGTYR,ph,T,439,true,"Arabidopsis root NAA phosphoproteome",18a,27643528,"MaxQuant Score",104.1800000,0.9780000,,,,2.2479999632619E-12,-0.1130000
VQIESGVMTAETGTYR,ph,T,439,true,"Ph protein kinases and peptide chip analysis",27,18433157,,,,,,,,
VQIESGVMTAETGTYR,ph,T,439,true,"Phosphorylation nuclei-enriched fractions",28,19245862,,,,,,,,
VQIESGVMTAETGTYR,ph,T,439,true,"Mitochondrial phosphoproteome",32,19688752,"MASCOT Score",80.1800000,,,,,,-3.0157400
VQIESGVMTAETGTYR,ph,T,439,true,"PAMP-triggered phosphorylation",48,24601666,"MASCOT Score",77.3200000,,,,,,
VQIESGVMTAETGTYR,ph,T,439,true,"Tyrosine phosphorylation in Arabidopsis",59,18463617,"MASCOT Score",98.0000000,,,,,,-0.4355411
VQIESGVMTAETGTYR,ph,T,439,true,"Chloroplast kinase substrates",60,19376835,"MASCOT Score",92.1600000,,,,,,-0.4171470
VQIESGVMTAETGTYR,ph,T,439,true,"Conserved plant phosphoproteome - Arabidopsis",61a,20466843,"MASCOT Score",93.0000000,1.0000000,,,,,
VQIESGVMTAETGTYR,ph,T,439,true,"srk2dei ABA signaling phopshoproteomics",83,23572148,"MASCOT Score",97.0000000,,,,,,0.0015000
VQIESGVMTAETGTYR,ph,T,439,true,"LAXIC - ABA stress",84a,23660473,XCorr,5.3900000,1.0000000,,,,0.00029961700784042,
VQIESGVMTAETGTYR,ph,T,439,true,"SnRK2 protein kinase substrates",85,23776212,XCorr,4.6824026,1.0000000,,,,6.6958096781988E-14,
VQIESGVMTAETGTYR,ph,T,439,true,"atm and atr DNA damage response",88,25561503,"MASCOT Score",83.0000000,0.9970000,,,,,-0.2400000
VQIESGVMTAETGTYR,ph,T,439,true,"TOR Kinase and ABA Receptor",100,29290610,XCorr,5.6365566,0.9959000,,,,1.4090000277633E-9,
VQIESGVMTAETGTYR,ph,T,439,true,"Lateral root-induction - NAA vs control",106,23328941,"MASCOT Score",78.0000000,,,,,,
VQIESGVMTAETGTYR,ph,T,439,true,"Phospho cell culture sucrose/TOR",109,30833711,,,0.9998870,,,,,
VQIESGVMTAETGTYR,ph,T,439,true,"Tissue atlas Arabidopsis - ProteomicsDB",114,32188942,"MaxQuant score",315.9400000,0.9999630,,,,0,
