Peptide,PTM,ModifiedAA,ModifiedPosition,PeptideUniqueToGene,ExperimentDesc,ExpID,PubmedID,ScoreType,IdentScore,LocProb,Log2FChange,PQ-val,QuantSig,PEP,MassErrorPPM
ASASTTVGSEQRVINFAAGPAALPE,nt,A,51,true,"N-terminal ChaFRADIC",92,26010716,"MASCOT Score",24.2700000,,,,,1.2540000149386E-9,
ASASTTVGSEQR,nt,A,51,true,"Arg/N-end rule pathway Roots",80,25728785,"MASCOT Score",102.0400000,,,,,1.8560000203394E-9,
ASASTTVGSEQR,nt,A,51,true,"Tic56 chloroplast import - wild-type",89a,25588737,XCorr,2.8990808,,,,,,
ASASTTVGSEQR,nt,A,51,true,"Tic56 chloroplast import - tic56-1",89c,25588737,XCorr,3.6841590,,,,,,
ASASTTVGSEQR,nt,A,51,true,"N-terminal ChaFRADIC",92,26010716,"MASCOT Score",69.3400000,,,,,0.00022479999461211,
ASASTTVGSEQR,nt,A,51,true,"Arg/N-end rule seed, prt6 vs. Wt",99,29168982,"MASCOT Score",46.9500000,,-0.0454974,0.3564618,NO,0.013620000332594,-0.8595454
ASASTTVGSE,nt,A,51,true,"N-terminal ChaFRADIC",92,26010716,"MASCOT Score",29.3600000,,,,,0.00086610001744702,
ASASTTVGSE,nt,A,51,true,"Arg/N-end rule seed, prt6 vs. Wt",99,29168982,"MASCOT Score",33.4900000,,-0.1615621,0.2919792,NO,0.0016299999551848,-2.0794520
ASASTTVGSEQRVIN,nta,A,51,true,"HUNTER N-terminome: legumain, GluC and trypsin",119,31951383,"MaxQuant score",127.7800000,,,,,,
ASASTTVGSEQR,nta,A,51,true,"Characterization plant N-terminal acetylation",6,22223895,"MASCOT Score",84.3500000,,,,,,
ASASTTVGSEQR,nta,A,51,true,"Arg/N-end rule pathway Roots",80,25728785,"MASCOT Score",63.0500000,,,,,0.00049549998948351,
ASASTTVGSEQR,nta,A,51,true,"N-terminal ChaFRADIC",92,26010716,"MASCOT Score",69.3400000,,,,,0.00022479999461211,
ASASTTVGSEQR,nta,A,51,true,"Arg/N-end rule seed, prt6 vs. Wt",99,29168982,"MASCOT Score",33.5300000,,,,,0.11159999668598,8.9441256
ASASTTVGSEQR,nta,A,51,true,"FtsH12 N-terminome: WT / FtsH12 knockdown miRNA",118,33216923,"MaxQuant score",133.5700000,,,,,1.0900000283062E-14,
SASTTVGSEQRVINFAAGPAALPE,nt,S,52,true,"N-terminal ChaFRADIC",92,26010716,"MASCOT Score",20.6600000,,,,,1.3929999909124E-7,
SASTTVGSEQR,nt,S,52,true,"Arg/N-end rule pathway Roots",80,25728785,"MASCOT Score",52.4700000,,,,,0.0035890000872314,
SASTTVGSEQR,nt,S,52,true,"Tic56 chloroplast import - tic56-1",89c,25588737,XCorr,3.3766263,,,,,,
SASTTVGSEQR,nt,S,52,true,"N-terminal ChaFRADIC",92,26010716,"MASCOT Score",40.2900000,,,,,9.3110003263064E-8,
SASTTVGSEQR,nt,S,52,true,"Arg/N-end rule seed, prt6 vs. Wt",99,29168982,"MASCOT Score",64.0300000,,-0.0775226,0.4923538,NO,0.0010829999810085,-1.5868032
SASTTVGSE,nt,S,52,true,"N-terminal ChaFRADIC",92,26010716,"MASCOT Score",35.5400000,,,,,0.00025949999690056,
SASTTVGSE,nt,S,52,true,"Arg/N-end rule seed, prt6 vs. Wt",99,29168982,"MASCOT Score",68.8700000,,0.0928265,0.7384331,NO,0.0003654999891296,0.8795040
SASTTVGSEQR,nta,S,52,true,"Characterization plant N-terminal acetylation",6,22223895,"MASCOT Score",73.2900000,,,,,,
SASTTVGSEQR,nta,S,52,true,"N-terminal ChaFRADIC",92,26010716,"MASCOT Score",23.5600000,,,,,0.0027240000199527,
STTVGSEQRVINFAAGPAALPENVLLKAQS,nt,S,54,true,"Arabidopsis translation initiation landscape - NT",167b,35069635,,,,,,,,
STTVGSEQR,nt,S,54,true,"Arg/N-end rule seed, prt6 vs. Wt",99,29168982,"MASCOT Score",34.5600000,,0.0160963,0.9148918,NO,0.10779999941587,-0.3164237
VIWSGKSEK,ac,K,182,false,"Quantitative Acetylproteomics",101,29440448,,,,,,,,
VPTFDGLEQSSDAK,ph,S,199,true,"Tissue atlas Arabidopsis - ProteomicsDB",114,32188942,"MaxQuant score",224.3600000,0.8000710,,,,0,
YLHICANETIHGVEFK,sno,C,207,false,"Site-specific nitrosomeproteomic id - gsnor1-3",90a,25699590,XCorr,3.8419230,,,,,3.2779999514787E-7,-3.6622465
YLHICANETIHGVEFK,sno,C,207,false,"Site-specific nitrosomeproteomic id - gsnor1-3",90b,25699590,XCorr,3.9900000,,,,,0.00021980000019539,-7.3800000
YLHICANETIHGVEFK,so,C,207,false,"Arabidopsis S-sulfenylation chemoproteomics",108,31578252,"pFind PSM Score",0.0033129,,2.3255800,,,,-1.1435154
YLHICANETIHGVEFK,so,C,207,false,"S-sulfenylation site detection using YAP1C",110,32714340,,,,,,,,
FGVIYAGAQK,ph,Y,252,true,"SIRK1 phosphorylation",86a,23820729,"MaxQuant Score",92.9700000,1.0000000,,,,0.13899999856949,-4.3280000
SVRSLMNVPFTLEK,mox,M,358,false,"cat2 Methionine oxidation - 3h stress",62b,25693801,"MASCOT Score",46.0000000,,0.8472296,,NO,,
SELEAEFIKEAAK,ac,K,375,false,"Histone deacetylases - apicidin vs control",98a,29061669,"MaxQuant Score",55.7000000,1.0000000,0.2210000,0.6053409,NO,0.00056999997468665,
SELEAEFIKEAAK,ac,K,375,false,"Histone deacetylases substrates - hda14 vs WT",98e,29061669,"MaxQuant Score",101.3000000,1.0000000,-0.0160000,0.9772372,NO,1.7000000296363E-9,
