Peptide,PTM,ModifiedAA,ModifiedPosition,PeptideUniqueToGene,ExperimentDesc,ExpID,PubmedID,ScoreType,IdentScore,LocProb,Log2FChange,PQ-val,QuantSig,PEP,MassErrorPPM
MKGGESKAEATSTDQRL,nta,M,1,true,"Arabidopsis translation initiation landscape - NTA",167a,35069635,,,,,,,,
MKGGESKAEATSTDQR,nta,M,1,true,"Arg/N-end rule pathway Roots",80,25728785,"MASCOT Score",27.2400000,,,,,0.0016009999671951,
KGGESKAEAT,nt,K,2,true,"N-term acetylation drought responses",5,26184543,,,,,,,,
MKGGESKAEATSTDQR,ub,K,2,true,"Arabidopsis ubiquitination COFRADIC",40,26744219,"MaxQuant Score",124.2900000,1.0000000,,,,8.2919997025265E-23,0.2790000
MKGGESKAEATSTDQR,ub,K,7,true,"Arabidopsis ubiquitination COFRADIC",40,26744219,"MaxQuant Score",124.2900000,1.0000000,,,,8.2919997025265E-23,0.2790000
KEFNLANPNNKSVATVGKAAGAR,ub,K,61,true,"Arabidopsis ubiquitination COFRADIC",40,26744219,"MaxQuant Score",103.8400000,1.0000000,,,,6.5909999280959E-37,-1.1720000
KEFNLANPNNKSVATVGKAAGAR,ub,K,68,true,"Arabidopsis ubiquitination COFRADIC",40,26744219,"MaxQuant Score",151.4200000,1.0000000,,,,0,-0.6720000
LASGTNREEDDSDKSK,ph,S,118,true,"Phospho cell culture sucrose/TOR",109,30833711,,,0.9946520,,,,,
LASGTNREEDDSDK,ph,S,118,true,"TOR Kinase and ABA Receptor",100,29290610,XCorr,3.0268202,1.0000000,,,,0.085210002958775,
EEDDSDKSK,ph,S,118,true,"atm and atr DNA damage response",88,25561503,"MASCOT Score",41.0000000,0.9460000,,,,,-3.4600000
SKSEVDEAVSEEEAEDDD,ph,S,121,true,"srk2dei ABA signaling phopshoproteomics",83,23572148,"MASCOT Score",63.0000000,,,,,,-0.0010000
SKSEVDEAVSEEEAEDDD,ph,S,121,true,"TOR Kinase and ABA Receptor",100,29290610,XCorr,4.8537636,1.0000000,,,,0.00050079997163266,
SKSEVDEAVSEEEAEDDD,ph,S,123,true,"Tyrosine phosphorylation in Arabidopsis",59,18463617,"MASCOT Score",79.0000000,,,,,,-1.3095738
SKSEVDEAVSEEEAEDDD,ph,S,123,true,"srk2dei ABA signaling phopshoproteomics",83,23572148,"MASCOT Score",86.0000000,,,,,,-0.0006000
SKSEVDEAVSEEEAEDDD,ph,S,123,true,"LAXIC - mannitol vs control",84b,23660473,XCorr,5.8900000,0.9680000,,,,4.1800001273948E-16,
SKSEVDEAVSEEEAEDDD,ph,S,123,true,"TOR Kinase and ABA Receptor",100,29290610,XCorr,8.6241436,0.9276000,,,,3.942000059709E-10,
SEVDEAVSEEEAEDDD,ph,S,123,true,"STN8 phosphoproteome",38,21768351,"MASCOT Score",51.4200000,,,,,,
SEVDEAVSEEEAEDDD,ph,S,123,true,"srk2dei ABA signaling phopshoproteomics",83,23572148,"MASCOT Score",40.0000000,,,,,,0.0010000
EEDDSDKSKSEVDEAVSEEEAEDDD,ph,S,130,true,"LAXIC - mannitol vs control",84b,23660473,XCorr,5.5900000,1.0000000,,,,0.0046533201821148,
EEDDSDKSKSEVDEAVSEEEAEDDD,ph,S,130,true,"SnRK2 protein kinase substrates",85,23776212,XCorr,4.6442494,1.0000000,,,,1.0373499890193E-6,
SKSEVDEAVSEEEAEDDD,ph,S,130,true,"Tyrosine phosphorylation in Arabidopsis",59,18463617,"MASCOT Score",93.0000000,,,,,,-1.1155626
SKSEVDEAVSEEEAEDDD,ph,S,130,true,"Chloroplast kinase substrates",60,19376835,"MASCOT Score",85.9000000,,,,,,-2.4801300
SKSEVDEAVSEEEAEDDD,ph,S,130,true,"srk2dei ABA signaling phopshoproteomics",83,23572148,"MASCOT Score",90.0000000,,,,,,0.0002000
SKSEVDEAVSEEEAEDDD,ph,S,130,true,"LAXIC - ABA stress",84a,23660473,XCorr,5.8600000,1.0000000,,,,0.00026064598932862,
SKSEVDEAVSEEEAEDDD,ph,S,130,true,"LAXIC - mannitol vs control",84b,23660473,XCorr,6.1000000,1.0000000,,,,5.2500000874423E-11,
SKSEVDEAVSEEEAEDDD,ph,S,130,true,"SnRK2 protein kinase substrates",85,23776212,XCorr,5.5729976,1.0000000,,,,0.00035418898914941,
SKSEVDEAVSEEEAEDDD,ph,S,130,true,"atm and atr DNA damage response",88,25561503,"MASCOT Score",62.0000000,1.0000000,,,,,-0.0600000
SKSEVDEAVSEEEAEDDD,ph,S,130,true,"Brassinosteroid-Regulated Phosphorylation Dynamics",94,26187819,"MaxQuant Score",156.8700000,1.0000000,,,,1.1620000311084E-16,-2.6400000
SKSEVDEAVSEEEAEDDD,ph,S,130,true,"TOR Kinase and ABA Receptor",100,29290610,XCorr,8.6241436,1.0000000,,,,3.942000059709E-10,
SKSEVDEAVSEEEAEDDD,ph,S,130,true,"Col-0 callus - FC Col-0 vs. Col-0 Xray",111a,31410901,,98.6800000,,-0.4325708,0.0000000,NO,,1.3973865
SKSEVDEAVSEEEAEDDD,ph,S,130,true,"Col-0 X-ray callus - FC Col-0 vs. Col-0 Xray",111b,31410901,,98.6800000,,-0.4325708,0.0000000,NO,,1.3973865
SKSEVDEAVSEEEAEDDD,ph,S,130,true,"atm callus - FC atm vs. atm Xray",111c,31410901,,98.6800000,,-1.3676353,0.0000000,NO,,1.3973865
SKSEVDEAVSEEEAEDDD,ph,S,130,true,"atm-3 X-ray callus - FC atm vs. atm Xray",111d,31410901,,98.6800000,,-1.3676353,0.0000000,NO,,1.3973865
SKSEVDEAVSEEEAEDDD,ph,S,130,true,"Tissue atlas Arabidopsis - ProteomicsDB",114,32188942,"MaxQuant score",339.6100000,1.0000000,,,,0,
SEVDEAVSEEEAEDDD,ph,S,130,true,"Phosphorylation nuclei-enriched fractions",28,19245862,,,,,,,,
SEVDEAVSEEEAEDDD,ph,S,130,true,"STN8 phosphoproteome",38,21768351,"MASCOT Score",76.7800000,,,,,,-1.5846200
SEVDEAVSEEEAEDDD,ph,S,130,true,"Chloroplast kinase substrates",60,19376835,"MASCOT Score",49.6600000,,,,,,-1.3141500
SEVDEAVSEEEAEDDD,ph,S,130,true,"srk2dei ABA signaling phopshoproteomics",83,23572148,"MASCOT Score",88.0000000,,,,,,0.0007000
SEVDEAVSEEEAEDDD,ph,S,130,true,"LAXIC - ABA stress",84a,23660473,XCorr,4.5500000,1.0000000,,,,5.0699999754045E-9,
SEVDEAVSEEEAEDDD,ph,S,130,true,"LAXIC - mannitol vs control",84b,23660473,XCorr,4.9100000,1.0000000,,,,2.6199998615084E-7,
SEVDEAVSEEEAEDDD,ph,S,130,true,"SnRK2 protein kinase substrates",85,23776212,XCorr,4.6159039,1.0000000,,,,9.444949682802E-5,
SEVDEAVSEEEAEDDD,ph,S,130,true,"atm and atr DNA damage response",88,25561503,"MASCOT Score",103.0000000,1.0000000,,,,,-0.1200000
SEVDEAVSEEEAEDDD,ph,S,130,true,"TOR Kinase and ABA Receptor",100,29290610,XCorr,4.3984241,1.0000000,,,,6.3670000827187E-7,
SEVDEAVSEEEAEDDD,ph,S,130,true,"Lateral root-induction - NAA vs control",106,23328941,"MASCOT Score",56.0000000,,,,,,
SEVDEAVSEEEAEDDD,ph,S,130,true,"Col-0 callus - FC Col-0 vs. Col-0 Xray",111a,31410901,,101.1100000,,1.5534865,0.0000000,NO,,0.9480165
SEVDEAVSEEEAEDDD,ph,S,130,true,"Col-0 X-ray callus - FC Col-0 vs. Col-0 Xray",111b,31410901,,101.1100000,,1.5534865,0.0000000,NO,,0.9480165
SEVDEAVSEEEAEDDD,ph,S,130,true,"atm callus - FC atm vs. atm Xray",111c,31410901,,101.1100000,,-7.5777205,0.0000000,NO,,0.9480165
SEVDEAVSEEEAEDDD,ph,S,130,true,"atm-3 X-ray callus - FC atm vs. atm Xray",111d,31410901,,101.1100000,,-7.5777205,0.0000000,NO,,0.9480165
