Peptide,PTM,ModifiedAA,ModifiedPosition,PeptideUniqueToGene,ExperimentDesc,ExpID,PubmedID,ScoreType,IdentScore,LocProb,Log2FChange,PQ-val,QuantSig,PEP,MassErrorPPM
NFRSENVLGEGGFGK,ph,S,89,true,"atm and atr DNA damage response",88,25561503,"MASCOT Score",46.0000000,1.0000000,,,,,-0.1000000
SENVLGEGGFGK,ph,S,89,true,"Tissue atlas Arabidopsis - ProteomicsDB",114,32188942,"MaxQuant score",159.4000000,1.0000000,,,,4.3710300136335E-12,
SENVLGEGGFGKVFK,ub,K,100,true,"Ubiquitination Membrane Proteins",120,33585938,,,,,,,,
ISDFGLAKLGPSASQSHITTR,ub,K,243,true,"Ubiquitination Membrane Proteins",120,33585938,,,,,,,,
LGPSASQSHITTR,ph,S,249,true,"atm and atr DNA damage response",88,25561503,"MASCOT Score",73.0000000,1.0000000,,,,,-0.7000000
LGPSASQSHITTR,ph,S,249,true,"Tissue atlas Arabidopsis - ProteomicsDB",114,32188942,"MaxQuant score",140.2200000,0.9987070,,,,1.3348399988899E-5,
LGPSASQSHITTR,ph,T,255,true,"atm and atr DNA damage response",88,25561503,"MASCOT Score",73.0000000,0.9850000,,,,,-0.4600000
VAQLALKCLGPEPK,ub,K,348,true,"Ubiquitination Membrane Proteins",120,33585938,,,,,,,,
CLGPEPK,so,C,349,true,"S-sulfenylation site detection using YAP1C",110,32714340,,,,,,,,
