Peptide,PTM,ModifiedAA,ModifiedPosition,PeptideUniqueToGene,ExperimentDesc,ExpID,PubmedID,ScoreType,IdentScore,LocProb,Log2FChange,PQ-val,QuantSig,PEP,MassErrorPPM
GGEGDSSQPQSGEGEAVAVNIR,nt,G,2,true,"Arg/N-end rule pathway Roots",80,25728785,"MASCOT Score",46.7900000,,,,,0.00057640002341941,
GGEGDSSQPQSGEGEAVAVNIR,nt,G,2,true,"N-terminal ChaFRADIC",92,26010716,"MASCOT Score",103.9800000,,,,,5.4849999325465E-13,
GGEGDSSQPQSGEGEAVAVNIR,nt,G,2,true,"Arg/N-end rule seed, prt6 vs. Wt",99,29168982,"MASCOT Score",85.7100000,,-0.1247600,0.4026993,NO,2.3380000129691E-5,1.1624729
GGEGDSSQPQSGEGEAVAVNIR,nt,G,2,true,"HUNTER N-terminome: legumain, GluC and trypsin",119,31951383,"MaxQuant score",186.0600000,,,,,,
GGEGDSSQPQSGEGEAVAVNIR,nt,G,2,true,"Arabidopsis translation initiation landscape - NT",167b,35069635,,,,,,,,
GGEGDSSQPQSGEGEAVAVN,nt,G,2,true,"Arg/N-end rule seed, prt6 vs. Wt",99,29168982,"MASCOT Score",23.6300000,,1.6356451,0.0000640,YES,0.11810000240803,-1.6433428
GGEGDSSQPQSGEGEAV,nt,G,2,true,"N-terminal ChaFRADIC",92,26010716,"MASCOT Score",32.2300000,,,,,1.3969999636265E-11,
GGEGDSSQPQSGEGE,nt,G,2,true,"N-terminal ChaFRADIC",92,26010716,"MASCOT Score",21.6400000,,,,,0.038059998303652,
GGEGDSSQPQ,nt,G,2,true,"Arg/N-end rule seed, prt6 vs. Wt",99,29168982,"MASCOT Score",45.8600000,,0.4591836,0.5557773,NO,0.10999999940395,-0.9998338
GGEGDSSQPQSGEGEAVAVNIR,nta,G,2,true,"FtsH12 N-terminome: WT / FtsH12 knockdown miRNA",118,33216923,"MaxQuant score",221.5600000,,,,,0,
GGEGDSSQPQSGEGEAVAVNIR,ph,S,8,true,"Tissue atlas Arabidopsis - ProteomicsDB",114,32188942,"MaxQuant score",147.1000000,0.8797530,,,,8.4064802589804E-33,
GGEGDSSQPQSGEGEAVAVNIR,ph,S,12,true,"Tissue atlas Arabidopsis - ProteomicsDB",114,32188942,"MaxQuant score",128.2200000,0.9999940,,,,1.7381300238436E-21,
FSVKTSLDSTVESFK,ub,K,33,true,"upl3 mutant / wildtype",168,35926874,"MaxQuant score",144.2900000,1.0000000,0.2986583,0.7550200,NO,1.260030014355E-11,-0.5788400
ILKDDQTLLSYGLQADHTIHMVR,ub,K,68,true,"upl3 mutant / wildtype",168,35926874,"MaxQuant score",118.3200000,1.0000000,0.3230818,0.3227600,NO,5.9705102520689E-17,-0.2847900
GSAPSSAPPPAPAASQTTAPSVTR,ph,S,94,true,"Tissue atlas Arabidopsis - ProteomicsDB",114,32188942,"MaxQuant score",73.8310000,0.7957270,,,,2.8267500340462E-8,
GSAPSSAPPPAPAASQTTAPSVTR,fuc,T,105,true,"SPINDLY O-fucosylation",162,36739885,,,,,,,-0.14000000059605,
SMIMNNPQMR,nt,S,192,false,"Arabidopsis translation initiation landscape - NT",167b,35069635,,,,,,,,
AMSNIESMPEGFNMLR,nt,A,243,false,"Arabidopsis translation initiation landscape - NT",167b,35069635,,,,,,,,
AMSNIESMPEGFNMLR,ph,S,245,false,"Tissue atlas Arabidopsis - ProteomicsDB",114,32188942,"MaxQuant score",124.0400000,1.0000000,,,,8.0070101660112E-8,
