Peptide,PTM,ModifiedAA,ModifiedPosition,PeptideUniqueToGene,ExperimentDesc,ExpID,PubmedID,ScoreType,IdentScore,LocProb,Log2FChange,PQ-val,QuantSig,PEP,MassErrorPPM
GGEADSRQPLTAEGVAVAVNVR,nt,G,2,true,"Arabidopsis translation initiation landscape - NT",167b,35069635,,,,,,,,
GGEADSRQPLTAE,nt,G,2,true,"N-terminal ChaFRADIC",92,26010716,"MASCOT Score",40.0600000,,,,,0.020600000396371,
GGEADSRQPLTAE,nta,G,2,true,"N-terminal ChaFRADIC",92,26010716,"MASCOT Score",40.0600000,,,,,0.020600000396371,
ILKDDQTLLSYGLQADHTVHMVR,ub,K,68,true,"upl3 mutant / wildtype",168,35926874,"MaxQuant score",152.0600000,1.0000000,0.7092906,0.1072830,NO,3.0352700296969E-25,-0.5803800
DDQTLLSYGLQADHTVHMVR,ph,T,83,true,"Phospho cell culture sucrose/TOR",109,30833711,,,0.9918400,,,,,
SMIMNNPQMR,nt,S,187,false,"Arabidopsis translation initiation landscape - NT",167b,35069635,,,,,,,,
AMSNIESMPEGFNMLR,nt,A,238,false,"Arabidopsis translation initiation landscape - NT",167b,35069635,,,,,,,,
AMSNIESMPEGFNMLR,ph,S,240,false,"Tissue atlas Arabidopsis - ProteomicsDB",114,32188942,"MaxQuant score",124.0400000,1.0000000,,,,8.0070101660112E-8,
NQGVTTQGSDTSNNISAPNAE,nt,N,288,true,"Arg/N-end rule seed, prt6 vs. Wt",99,29168982,"MASCOT Score",60.4500000,,-0.5923494,0.3533758,NO,2.361000071005E-7,-1.0593153
