Peptide,PTM,ModifiedAA,ModifiedPosition,PeptideUniqueToGene,ExperimentDesc,ExpID,PubmedID,ScoreType,IdentScore,LocProb,Log2FChange,PQ-val,QuantSig,PEP,MassErrorPPM
SILGANNLPLNTSR,ng,N,76,true,"Conserved N-glycosylation",74,22633491,"MaxQuant Score",192.5300000,1.0000000,,,,4.9676030560315E-42,0.1060000
SILGANNLPLNTSR,ng,N,76,true,"N-glycan occupancy Arabidopsis glycoproteins",87,23994444,"Ladder score",85.2000000,,,,,,
SILGANNLPLNTSR,ng,N,76,true,"N-linked Glycan Micro-heterogeneity Arabidopsis",134,29237727,,,,,,,,
SILGANNLPLNTSR,ng,N,76,true,"UDP-GlcNAc transporter glycopeptide analysis",135,30224661,,,,,,,2.4897438694456E-15,0.8000000
VPIHCSCSNGTGVSNR,ng,N,99,true,"Conserved N-glycosylation",74,22633491,"MaxQuant Score",212.9900000,1.0000000,,,,0,-0.6550000
VPIHCSCSNGTGVSNR,ng,N,99,true,"N-linked Glycan Micro-heterogeneity Arabidopsis",134,29237727,,,,,,,,
VPIHCSCSNGTGVSNR,ng,N,99,true,"UDP-GlcNAc transporter glycopeptide analysis",135,30224661,,,,,,,3.0021502569586E-16,0.8000000
FWIPLPCSCDKLNGEDVVHYAHVVK,ox,C,159,true,"OxiTRAQ SA and flg22 responses - SA vs mock",91a,25720653,"MASCOT Score",26.1800000,,1.0426443,0.0130000,YES,,
FWIPLPCSCDKLNGEDVVHYAHVVK,ox,C,159,true,"OxiTRAQ SA and flg22 responses - flg22 vs mock",91b,25720653,"MASCOT Score",26.1800000,,1.0356239,0.0370000,YES,,
FWIPLPCSCDKLNGEDVVHYAHVVK,ox,C,161,true,"OxiTRAQ SA and flg22 responses - SA vs mock",91a,25720653,"MASCOT Score",26.1800000,,1.0426443,0.0130000,YES,,
FWIPLPCSCDKLNGEDVVHYAHVVK,ox,C,161,true,"OxiTRAQ SA and flg22 responses - flg22 vs mock",91b,25720653,"MASCOT Score",26.1800000,,1.0356239,0.0370000,YES,,
LGSSLGEIAAQFGTDNTTLAQLNGIIGDSQLLADKPLDVPLK,ng,N,193,true,"Conserved N-glycosylation",74,22633491,"MaxQuant Score",173.9200000,1.0000000,,,,2.9270000353307E-33,1.9160000
ACSSSVR,sno,C,221,true,"hot5-4 / wildtype, FAT-switch S-nitrosoproteome",169,37277371,,,,-0.5880943,0.0365961,YES,,
KDSLDAPLLLSNNSYVFTANNCVK,ng,N,238,true,"Conserved N-glycosylation",74,22633491,"MaxQuant Score",284.2800000,0.9910000,,,,0,-0.2900000
KDSLDAPLLLSNNSYVFTANNCVK,ng,N,238,true,"N-linked Glycan Micro-heterogeneity Arabidopsis",134,29237727,,,,,,,,
KDSLDAPLLLSNNSYVFTANNCVK,ng,N,238,true,"UDP-GlcNAc transporter glycopeptide analysis",135,30224661,,,,,,,5.3728591569585E-16,2.5000000
