Peptide,PTM,ModifiedAA,ModifiedPosition,PeptideUniqueToGene,ExperimentDesc,ExpID,PubmedID,ScoreType,IdentScore,LocProb,Log2FChange,PQ-val,QuantSig,PEP,MassErrorPPM
KASEENVVNGDGEK,ph,S,94,true,"TOR Kinase and ABA Receptor",100,29290610,XCorr,3.1965003,1.0000000,,,,7.9820001701592E-6,
KASEENVVNGDGEK,ph,S,94,true,"Tissue atlas Arabidopsis - ProteomicsDB",114,32188942,"MaxQuant score",139.6300000,1.0000000,,,,6.8662898229377E-6,
DLEDVQDEVSGK,ph,S,383,true,"Tissue atlas Arabidopsis - ProteomicsDB",114,32188942,"MaxQuant score",134.1300000,1.0000000,,,,2.7685800887411E-5,
NPSVSKEPVHEPWPLHR,ph,S,410,true,"Tissue atlas Arabidopsis - ProteomicsDB",114,32188942,"MaxQuant score",50.2550000,0.9860350,,,,0.0009351649787277,
ILVDKEENEPSTDLSK,ph,S,615,true,"Tissue atlas Arabidopsis - ProteomicsDB",114,32188942,"MaxQuant score",124.0400000,0.8303720,,,,2.2097799501353E-7,
SSSIEGNSDADIYAENDSGR,ph,S,698,true,"Conserved plant phosphoproteome - Arabidopsis",61a,20466843,"MASCOT Score",38.0000000,1.0000000,,,,,
SSSIEGNSDADIYAENDSGR,ph,S,698,true,"atm and atr DNA damage response",88,25561503,"MASCOT Score",45.0000000,0.9540000,,,,,0.3400000
SSSIEGNSDADIYAENDSGR,ph,S,699,true,"SnRK2 protein kinase substrates",85,23776212,XCorr,3.5658915,0.9410000,,,,2.7114500423565E-13,
SSSIEGNSDADIYAENDSGR,ph,S,699,true,"atm and atr DNA damage response",88,25561503,"MASCOT Score",50.0000000,0.9970000,,,,,0.7300000
SSSIEGNSDADIYAENDSGR,ph,S,699,true,"Lateral root-induction - NAA vs control",106,23328941,"MASCOT Score",23.0000000,,,,,,
SSSIEGNSDADIYAENDSGR,ph,S,699,true,"Tissue atlas Arabidopsis - ProteomicsDB",114,32188942,"MaxQuant score",285.9600000,0.9856570,,,,0,
SSSIEGNSDADIYAENDSGR,ph,S,704,true,"atm and atr DNA damage response",88,25561503,"MASCOT Score",35.0000000,1.0000000,,,,,0.8000000
SSSIEGNSDADIYAENDSGR,ph,S,704,true,"Tissue atlas Arabidopsis - ProteomicsDB",114,32188942,"MaxQuant score",232.2900000,1.0000000,,,,0,
LASGIFSR,ph,S,735,true,"srk2dei ABA signaling phopshoproteomics",83,23572148,"MASCOT Score",32.0000000,,,,,,0.0002000
LASGIFSR,ph,S,735,true,"atm and atr DNA damage response",88,25561503,"MASCOT Score",32.0000000,1.0000000,,,,,0.4500000
LASGIFSR,ph,S,735,true,"TOR Kinase and ABA Receptor",100,29290610,XCorr,2.7024388,1.0000000,,,,0.00090869999257848,
LASGIFSR,ph,S,735,true,"Tissue atlas Arabidopsis - ProteomicsDB",114,32188942,"MaxQuant score",104.2200000,1.0000000,,,,0.0044228099286556,
LASGIFSR,ph,S,739,true,"Tissue atlas Arabidopsis - ProteomicsDB",114,32188942,"MaxQuant score",84.8960000,0.9999130,,,,0.0077815600670874,
SVDSSSSDYTVENVYK,ph,S,744,true,"srk2dei ABA signaling phopshoproteomics",83,23572148,"MASCOT Score",74.0000000,,,,,,0.0017000
SVDSSSSDYTVENVYK,ph,S,744,true,"LAXIC - mannitol vs control",84b,23660473,XCorr,2.6300000,0.9480000,,,,9.3199997763804E-7,
SVDSSSSDYTVENVYK,ph,S,744,true,"SnRK2 protein kinase substrates",85,23776212,XCorr,3.6451535,1.0000000,,,,5.0739898393992E-12,
SVDSSSSDYTVENVYK,ph,S,744,true,"TOR Kinase and ABA Receptor",100,29290610,XCorr,5.4802132,1.0000000,,,,1.2220000122909E-8,
SVDSSSSDYTVENVYK,ph,S,744,true,"Lateral root-induction - NAA vs control",106,23328941,"MASCOT Score",100.0000000,,,,,,
SVDSSSSDYTVENVYK,ph,S,744,true,"Phospho cell culture sucrose/TOR",109,30833711,,,0.9999870,,,,,
SVDSSSSDYTVENVYK,ph,S,744,true,"Tissue atlas Arabidopsis - ProteomicsDB",114,32188942,"MaxQuant score",337.9000000,1.0000000,,,,0,
SVDSSSSDYTVENVYK,ph,S,747,true,"Lateral root-induction - NAA vs control",106,23328941,"MASCOT Score",92.0000000,,,,,,
SVDSSSSDYTVENVYK,ph,S,747,true,"Tissue atlas Arabidopsis - ProteomicsDB",114,32188942,"MaxQuant score",128.0600000,0.9666290,,,,9.8781399060499E-8,
SVDSSSSDYTVENVYK,ph,Y,752,true,"atm and atr DNA damage response",88,25561503,"MASCOT Score",24.0000000,0.8030000,,,,,0.5200000
QAESTNPSDETDSLDDPSPSK,ph,S,763,true,"Conserved plant phosphoproteome - Arabidopsis",61a,20466843,"MASCOT Score",60.0000000,1.0000000,,,,,
QAESTNPSDETDSLDDPSPSK,ph,S,772,true,"SnRK2 protein kinase substrates",85,23776212,XCorr,3.9572015,0.9970000,,,,0.007845220156014,
QAESTNPSDETDSLDDPSPSK,ph,S,772,true,"TOR Kinase and ABA Receptor",100,29290610,XCorr,5.3961716,0.9897000,,,,1.4250000504035E-6,
QAESTNPSDETDSLDDPSPSK,ph,S,772,true,"Phospho cell culture sucrose/TOR",109,30833711,,,0.9264440,,,,,
QAESTNPSDETDSLDDPSPSK,ph,S,772,true,"Tissue atlas Arabidopsis - ProteomicsDB",114,32188942,"MaxQuant score",296.6800000,0.9994510,,,,0,
QAESTNPSDETDSLDDPSPSK,ph,S,777,true,"Tissue atlas Arabidopsis - ProteomicsDB",114,32188942,"MaxQuant score",180.4600000,0.9308650,,,,3.783505853677E-44,
VNVTDNCESK,ph,S,789,true,"Tissue atlas Arabidopsis - ProteomicsDB",114,32188942,"MaxQuant score",207.1200000,1.0000000,,,,1.421599967811E-19,
