Peptide,PTM,ModifiedAA,ModifiedPosition,PeptideUniqueToGene,ExperimentDesc,ExpID,PubmedID,ScoreType,IdentScore,LocProb,Log2FChange,PQ-val,QuantSig,PEP,MassErrorPPM
GDGTEFVVRS,nt,G,2,true,"Arabidopsis translation initiation landscape - NT",167b,35069635,,,,,,,,
GDGTEFVVR,nt,G,2,true,"Arg/N-end rule pathway Roots",80,25728785,"MASCOT Score",32.1900000,,,,,0.010359999723732,
GDGTEFVVR,nt,G,2,true,"Arg/N-end rule seed, prt6 vs. Wt",99,29168982,"MASCOT Score",65.6500000,,0.2402447,0.0942219,NO,0.020880000665784,0.2638499
GDGTEFVVR,nta,G,2,true,"Characterization plant N-terminal acetylation",6,22223895,"MASCOT Score",46.7900000,,,,,,
GDGTEFVVR,nta,G,2,true,"Arg/N-end rule seed, prt6 vs. Wt",99,29168982,"MASCOT Score",65.6500000,,,,,0.020880000665784,0.2638499
GDGTEFVVR,nta,G,2,true,"FtsH12 N-terminome: WT / FtsH12 knockdown miRNA",118,33216923,"MaxQuant score",50.0290000,,,,,0.0063205999322236,
LAEDRISDEQVVK,ph,S,24,true,"Tissue atlas Arabidopsis - ProteomicsDB",114,32188942,"MaxQuant score",142.7400000,1.0000000,,,,9.0443000999585E-7,
ISDEQVVKNELVR,ub,K,30,true,"Arabidopsis ubiquitination COFRADIC",40,26744219,"MaxQuant Score",70.8890000,1.0000000,,,,0.00010509999992792,0.1480000
SDEVRDDNEDEVFEEAIGSENDEQEEEEDPKR,ph,S,54,true,"STN8 phosphoproteome",38,21768351,"MASCOT Score",112.9400000,,,,,,-1.1632100
SDEVRDDNEDEVFEEAIGSENDEQEEEEDPKR,ph,S,54,true,"LAXIC - ABA stress",84a,23660473,XCorr,5.9200000,0.9850000,,,,0.00050132599426433,
SDEVRDDNEDEVFEEAIGSENDEQEEEEDPKR,ph,S,54,true,"LAXIC - mannitol vs control",84b,23660473,XCorr,5.7500000,1.0000000,,,,4.6599998313468E-6,
SDEVRDDNEDEVFEEAIGSENDEQEEEEDPKR,ph,S,54,true,"SnRK2 protein kinase substrates",85,23776212,XCorr,5.2766604,1.0000000,,,,0.0022908200044185,
SDEVRDDNEDEVFEEAIGSENDEQEEEEDPKR,ph,S,54,true,"TOR Kinase and ABA Receptor",100,29290610,XCorr,5.5856404,1.0000000,,,,1.2660000265896E-6,
SDEVRDDNEDEVFEEAIGSENDEQEEEEDPK,ph,S,54,true,"srk2dei ABA signaling phopshoproteomics",83,23572148,"MASCOT Score",59.0000000,,,,,,-0.0023000
SDEVRDDNEDEVFEEAIGSENDEQEEEEDPK,ph,S,54,true,"TOR Kinase and ABA Receptor",100,29290610,XCorr,5.8308177,1.0000000,,,,7.0829997866895E-7,
DDNEDEVFEEAIGSENDEQEEEEDPKR,ph,S,54,true,"SnRK2 protein kinase substrates",85,23776212,XCorr,2.8630233,1.0000000,,,,0.022248100489378,
SSMVEHEVEDFEEAVGDLDETSSNEGGVK,ph,S,104,true,"TOR Kinase and ABA Receptor",100,29290610,XCorr,5.9500012,0.9779000,,,,1.5249999307798E-7,
SSMVEHEVEDFEEAVGDLDETSSNEGGVK,ph,S,105,true,"SnRK2 protein kinase substrates",85,23776212,XCorr,3.6115489,0.8190000,,,,6.9443700789762E-10,
SSMVEHEVEDFEEAVGDLDETSSNEGGVK,ph,S,105,true,"TOR Kinase and ABA Receptor",100,29290610,XCorr,5.9500012,0.9779000,,,,1.5249999307798E-7,
DFTAVGESHGAGEAEFDVLATK,ph,S,119,true,"Tissue atlas Arabidopsis - ProteomicsDB",114,32188942,"MaxQuant score",163.1600000,1.0000000,,,,9.9007397750344E-39,
THSFLGNGIASPK,ph,S,195,true,"Tyrosine phosphorylation in Arabidopsis",59,18463617,"MASCOT Score",27.0000000,,,,,,-0.7814422
THSFLGNGIASPK,ph,S,195,true,"Conserved plant phosphoproteome - Arabidopsis",61a,20466843,"MASCOT Score",42.0000000,1.0000000,,,,,
THSFLGNGIASPK,ph,S,195,true,"SnRK2 protein kinase substrates",85,23776212,XCorr,2.1212790,1.0000000,,,,0.016042800620198,
THSFLGNGIASPK,ph,S,195,true,"atm and atr DNA damage response",88,25561503,"MASCOT Score",81.0000000,1.0000000,,,,,-0.1400000
THSFLGNGIASPK,ph,S,195,true,"TOR Kinase and ABA Receptor",100,29290610,XCorr,3.9814897,1.0000000,,,,0.00014370000280906,
THSFLGNGIASPK,ph,S,195,true,"Lateral root-induction - NAA vs control",106,23328941,"MASCOT Score",42.0000000,,,,,,
THSFLGNGIASPK,ph,S,195,true,"Tissue atlas Arabidopsis - ProteomicsDB",114,32188942,"MaxQuant score",271.4700000,1.0000000,,,,0,
DLFENGSVCMDSESEAER,ph,S,291,true,"Tissue atlas Arabidopsis - ProteomicsDB",114,32188942,"MaxQuant score",228.4600000,1.0000000,,,,0,
DLFENGSVCMDSESEAER,ph,S,296,true,"Tyrosine phosphorylation in Arabidopsis",59,18463617,"MASCOT Score",94.0000000,,,,,,-0.9750256
DLFENGSVCMDSESEAER,ph,S,296,true,"Tissue atlas Arabidopsis - ProteomicsDB",114,32188942,"MaxQuant score",356.8300000,0.9974270,,,,0,
QHLASSPHSYPE,nt,Q,355,true,"HUNTER N-terminome: legumain, GluC and trypsin",119,31951383,"MaxQuant score",127.7600000,,,,,,
EHKPVQSANGGHDVQSPQPNKELEK,ph,S,398,true,"Tissue atlas Arabidopsis - ProteomicsDB",114,32188942,"MaxQuant score",177.3300000,1.0000000,,,,0,
VHVDPEITENSHVETEPEVVSSVSPTESR,ph,S,434,true,"Tissue atlas Arabidopsis - ProteomicsDB",114,32188942,"MaxQuant score",180.9700000,0.8111020,,,,0,
VHVDPEITENSHVETEPEVVSSVSPTESR,ph,S,436,true,"Large-scale phosphorylation discovery",44,23111157,XCorr,5.3250000,,,,,,
VHVDPEITENSHVETEPEVVSSVSPTESR,ph,S,436,true,"Conserved plant phosphoproteome - Arabidopsis",61a,20466843,"MASCOT Score",44.0000000,1.0000000,,,,,
VHVDPEITENSHVETEPEVVSSVSPTESR,ph,S,436,true,"Phospho cell culture sucrose/TOR",109,30833711,,,0.8489820,,,,,
VHVDPEITENSHVETEPEVVSSVSPTESR,ph,S,436,true,"Tissue atlas Arabidopsis - ProteomicsDB",114,32188942,"MaxQuant score",234.9800000,0.9525080,,,,0,
ASPLLEPASR,ph,S,459,true,"atm and atr DNA damage response",88,25561503,"MASCOT Score",43.0000000,1.0000000,,,,,-0.1300000
ASPLLEPASR,ph,S,459,true,"Tissue atlas Arabidopsis - ProteomicsDB",114,32188942,"MaxQuant score",97.4390000,1.0000000,,,,0.00050510099390522,
ASPLLEPASR,ph,S,466,true,"Tissue atlas Arabidopsis - ProteomicsDB",114,32188942,"MaxQuant score",60.5610000,1.0000000,,,,0.00023029399744701,
VGAFSFDR,ph,S,552,false,"atm and atr DNA damage response",88,25561503,"MASCOT Score",35.0000000,1.0000000,,,,,-0.7700000
VGAFSFDR,ph,S,552,false,"Tissue atlas Arabidopsis - ProteomicsDB",114,32188942,"MaxQuant score",84.6580000,1.0000000,,,,0.0078244702890515,
LPEQQYGDEEDEDDLEESSDSDEESEYDQLPPFK,ph,S,844,true,"Brassinosteroid-Regulated Phosphorylation Dynamics",94,26187819,"MaxQuant Score",98.8390000,0.9060000,,,,8.7049999153432E-11,0.0660000
LPEQQYGDEEDEDDLEESSDSDEESEYDQLPPFK,ph,S,845,true,"Brassinosteroid-Regulated Phosphorylation Dynamics",94,26187819,"MaxQuant Score",98.8390000,0.9060000,,,,8.7049999153432E-11,0.0660000
LPEQQYGDEEDEDDLEESSDSDEESEYDQLPPFK,ph,S,847,true,"Brassinosteroid-Regulated Phosphorylation Dynamics",94,26187819,"MaxQuant Score",98.8390000,0.9060000,,,,8.7049999153432E-11,0.0660000
LPEQQYGDEEDEDDLEESSDSDEESEYDQLPPFK,ph,S,851,true,"Brassinosteroid-Regulated Phosphorylation Dynamics",94,26187819,"MaxQuant Score",91.1000000,0.9040000,,,,4.1439999876047E-8,0.7400000
