Peptide,PTM,ModifiedAA,ModifiedPosition,PeptideUniqueToGene,ExperimentDesc,ExpID,PubmedID,ScoreType,IdentScore,LocProb,Log2FChange,PQ-val,QuantSig,PEP,MassErrorPPM
ATNPKVYFDMTVGGKSAGR,nt,A,2,true,"N-terminal ChaFRADIC",92,26010716,"MASCOT Score",28.7500000,,,,,1.6730000425014E-6,
ATNPKVYFDMTVGGKSAGR,nt,A,2,true,"Stromal N-terminome",96,26371235,"MASCOT Score",66.0400000,,,,,,
ATNPKVYFDMTVGGKS,nt,A,2,true,"N-terminal ChaFRADIC",92,26010716,"MASCOT Score",31.2600000,,,,,0.014189999550581,
ATNPKVYFDM,nt,A,2,true,"N-term acetylation drought responses",5,26184543,,,,,,,,
ATNPKVYFDM,nt,A,2,true,"Arg/N-end rule seed, prt6 vs. Wt",99,29168982,"MASCOT Score",22.3500000,,,,,0.14589999616146,-0.0255678
ATNPKVYFD,nt,A,2,true,"Arg/N-end rule seed, prt6 vs. Wt",99,29168982,"MASCOT Score",24.3500000,,,,,0.020290000364184,-3.2402048
ATNPKVYFDMTVGGKSAGRIVME,nta,A,2,true,"Arabidopsis translation initiation landscape - NTA",167a,35069635,,,,,,,,
ATNPKVYFDMTVGGKSAGR,nta,A,2,true,"Arg/N-end rule pathway Roots",80,25728785,"MASCOT Score",90.7500000,,,,,8.0530000445833E-8,
ATNPKVYFDMTVGGKSAGR,nta,A,2,true,"N-terminal ChaFRADIC",92,26010716,"MASCOT Score",28.7500000,,,,,1.6730000425014E-6,
ATNPKVYFDMTVGGKSAGR,nta,A,2,true,"Stromal N-terminome",96,26371235,"MASCOT Score",66.0400000,,,,,,
ATNPKVYFDMTVGGKSAGR,nta,A,2,true,"HUNTER N-terminome: legumain, GluC and trypsin",119,31951383,"MaxQuant score",72.2100000,,,,,,
ATNPKVYFDMTVGGKS,nta,A,2,true,"N-terminal ChaFRADIC",92,26010716,"MASCOT Score",31.2600000,,,,,0.014189999550581,
ATNPKVYFDMTVGGK,nta,A,2,true,"Arg/N-end rule pathway Roots",80,25728785,"MASCOT Score",74.8000000,,,,,0.00018879999697674,
ATNPKVYFDM,nta,A,2,true,"N-term acetylation drought responses",5,26184543,,,,,,,,
ATNPKVYFDM,nta,A,2,true,"Arg/N-end rule seed, prt6 vs. Wt",99,29168982,"MASCOT Score",22.3500000,,-0.1151705,0.3217098,NO,0.14589999616146,-0.0255678
ATNPKVYFD,nta,A,2,true,"Arg/N-end rule seed, prt6 vs. Wt",99,29168982,"MASCOT Score",24.3500000,,-0.3416060,0.1938016,NO,0.020290000364184,-3.2402048
ATNPKVYFD,nta,A,2,true,"HUNTER N-terminome: legumain, GluC and trypsin",119,31951383,"MaxQuant score",77.0720000,,,,,,
VYFDMTVGGK,mox,M,11,true,"cat2 Methionine oxidation - 1h stress",62a,25693801,"MASCOT Score",63.0000000,,0.1129677,,NO,,
VYFDMTVGGK,mox,M,11,true,"cat2 Methionine oxidation - 3h stress",62b,25693801,"MASCOT Score",38.0000000,,-0.0832105,,NO,,
MTVGGKSAGRIVME,nt,M,11,true,"Arabidopsis translation initiation landscape - NT",167b,35069635,,,,,,,,
VYFDMTVGGKSAGR,ac,K,16,true,"Quantitative Acetylproteomics",101,29440448,,,,,,,,
ATNPKVYFDMTVGGKSAGR,ub,K,16,true,"Arabidopsis ubiquitination COFRADIC",40,26744219,"MaxQuant Score",81.0160000,1.0000000,,,,4.1839998804992E-14,-0.2500000
VYFDMTVGGKSAGR,ub,K,16,true,"upl3 mutant / wildtype",168,35926874,"MaxQuant score",49.2980000,1.0000000,-0.0014434,0.9986400,NO,0.0030261999927461,-0.6550400
IVMELYADTTPETAENFR,nt,I,21,true,"Arabidopsis translation initiation landscape - NT",167b,35069635,,,,,,,,
ALCTGER,sno,C,41,true,"hot5-4 / wildtype, FAT-switch S-nitrosoproteome",169,37277371,,,,,,,,
ALCTGER,so,C,41,true,"Arabidopsis S-sulfenylation chemoproteomics",108,31578252,"pFind PSM Score",0.0264115,,0.8755600,,,,0.7074989
ALCTGER,so,C,41,true,"S-sulfenylation site detection using YAP1C",110,32714340,,,,,,,,
GIGKQGKPLHYK,nt,G,46,true,"Arabidopsis translation initiation landscape - NT",167b,35069635,,,,,,,,
GIGKQGK,ac,K,49,true,"Histone deacetylases - apicidin vs control",98a,29061669,"MaxQuant Score",105.4000000,1.0000000,0.2410000,0.4677351,NO,0.01799999922514,
QGKPLHYK,ac,K,52,true,"Quantitative Acetylproteomics",101,29440448,,,,,,,,
VIPKFMCQGGDFTAGNGTGGESIYGSK,ub,K,67,true,"upl3 mutant / wildtype",168,35926874,"MaxQuant score",65.7410000,1.0000000,-0.4227525,0.6255000,NO,3.5850200674759E-7,0.2702800
FMCQGGDFTAGNGTGGESIYGSK,acy,C,70,false,"Arabidopsis S-acylation atlas - Stem",163f,35681017,,,,,,,,
CQGGDFTAGNGTGGE,nt,C,70,false,"Arg/N-end rule seed, prt6 vs. Wt",99,29168982,"MASCOT Score",23.4600000,,0.5080163,0.6347004,NO,0.028480000793934,-4.5692258
FMCQGGDFTAGNGTGGESIYGSK,sno,C,70,false,"Site-specific nitrosomeproteomic id - gsnor1-3",90a,25699590,XCorr,4.3459339,,,,,0.00093069998547435,-3.8068577
FMCQGGDFTAGNGTGGESIYGSK,sno,C,70,false,"Site-specific nitrosomeproteomic id - gsnor1-3",90b,25699590,XCorr,3.9700000,,,,,6.1899999082016E-7,-5.0100000
FMCQGGDFTAGNGTGGESIYGSK,so,C,70,false,"S-sulfenylation site detection using YAP1C",110,32714340,,,,,,,,
QGGDFTAGNGTGGE,nt,Q,71,false,"Arg/N-end rule seed, prt6 vs. Wt",99,29168982,"MASCOT Score",44.7200000,,-0.2877350,0.0076586,NO,3.0689999874767E-8,-1.7857494
GGDFTAGNGTGGE,nt,G,72,false,"Arg/N-end rule seed, prt6 vs. Wt",99,29168982,"MASCOT Score",53.3900000,,-0.1783613,0.1899228,NO,8.7569998868275E-5,-1.2493456
FMCQGGDFTAGNGTGGESIYGSK,ph,S,89,false,"Tissue atlas Arabidopsis - ProteomicsDB",114,32188942,"MaxQuant score",189.2400000,0.9989740,,,,0,
FKDENFIK,ub,K,92,false,"upl3 mutant / wildtype",168,35926874,"MaxQuant score",74.2670000,1.0000000,-0.9770996,0.4512400,NO,0.01377599965781,0.1452700
FKDENFIKK,ac,K,98,false,"Quantitative Acetylproteomics",101,29440448,,,,,,,,
GSQFFICTE,nt,G,117,false,"Arg/N-end rule seed, prt6 vs. Wt",99,29168982,"MASCOT Score",39.2100000,,-0.2897277,0.5137449,NO,0.0073910001665354,-1.7648948
TSWLDGKHVVFGQVVEGLNVVR,ub,K,133,true,"upl3 mutant / wildtype",168,35926874,"MaxQuant score",131.8600000,1.0000000,0.1322478,0.9031800,NO,1.2741200300061E-20,0.4203500
HVVFGQVVE,nt,H,134,false,"Arg/N-end rule seed, prt6 vs. Wt",99,29168982,"MASCOT Score",42.4900000,,-0.1787258,0.7497709,NO,0.003800000064075,-1.9967816
DIEKVGSDSGR,nt,D,149,true,"Metacaspase9 substrates - in vitro rMC9",51c,23964026,"MASCOT Score",48.0000000,,3.1567359,,NO,,-1.0689678
DIEKVGSDSGR,ac,K,152,true,"Histone deacetylases substrates - hda14 vs WT",98e,29061669,"MaxQuant Score",90.7000000,1.0000000,-0.4040000,0.5714786,NO,8.3000004451605E-6,
DIEKVGSDSGR,ub,K,152,true,"Arabidopsis ubiquitination COFRADIC",40,26744219,"MaxQuant Score",90.6140000,1.0000000,,,,0.00076389999594539,-0.2200000
DIEKVGSDSGR,ub,K,152,true,"upl3 mutant / wildtype",168,35926874,"MaxQuant score",75.8190000,1.0000000,-0.7154859,0.5509600,NO,0.0021716200280935,0.8017000
VGSDSGRTSKPVVIADCGQIS,ph,S,161,true,"srk2dei ABA signaling phopshoproteomics",83,23572148,"MASCOT Score",31.0000000,,,,,,0.0013000
TSKPVVIADCGQIS,ub,K,162,true,"Arabidopsis ubiquitination COFRADIC",40,26744219,"MaxQuant Score",83.6330000,1.0000000,,,,0.00010099999781232,-0.1920000
TSKPVVIADCGQIS,ub,K,162,true,"upl3 mutant / wildtype",168,35926874,"MaxQuant score",48.5270000,1.0000000,,,,0.01095400005579,-0.5364000
TSKPVVIADCGQIS,ox,C,169,true,"OxiTRAQ Arabidopsis - 5 mM H2O2 versus control",47,24376095,,,,-0.1962690,0.3215098,NO,,
TSKPVVIADCGQIS,ox,C,169,true,"SPEAR - 10 mM H2O2 / mock",138a,34619326,,,,3.5291107,0.0002060,YES,,
TSKPVVIADCGQIS,sno,C,169,true,"Site-specific nitrosomeproteomic id - gsnor1-3",90a,25699590,XCorr,3.1800000,,,,,0.00029140000697225,-6.4800000
TSKPVVIADCGQIS,sno,C,169,true,"Site-specific nitrosomeproteomic id - gsnor1-3",90b,25699590,XCorr,2.5900000,,,,,0.1119000017643,-6.6100000
VGSDSGRTSKPVVIADCGQIS,so,C,169,true,"S-sulfenylation site detection using YAP1C",110,32714340,,,,,,,,
