Peptide,PTM,ModifiedAA,ModifiedPosition,PeptideUniqueToGene,ExperimentDesc,ExpID,PubmedID,ScoreType,IdentScore,LocProb,Log2FChange,PQ-val,QuantSig,PEP,MassErrorPPM
MDSDSERASLESIK,ph,S,3,true,"atm and atr DNA damage response",88,25561503,"MASCOT Score",33.0000000,1.0000000,,,,,-1.6700000
MDSDSERASLESIK,ph,S,3,true,"TOR Kinase and ABA Receptor",100,29290610,XCorr,2.8467376,0.8882000,,,,0.0031089999247342,
MDSDSERASLESIK,ph,S,5,true,"atm and atr DNA damage response",88,25561503,"MASCOT Score",33.0000000,1.0000000,,,,,-1.6700000
EEDFVAEANLSGDRLEENK,ph,S,145,true,"TOR Kinase and ABA Receptor",100,29290610,XCorr,2.4063869,1.0000000,,,,0.0022400000598282,
EEDFVAEANLSGDRLEENK,ph,S,145,true,"Tissue atlas Arabidopsis - ProteomicsDB",114,32188942,"MaxQuant score",119.1600000,1.0000000,,,,9.4133998623899E-15,
EVSMEEEPSSHELSVCEVNGVDSLNDEENR,ph,S,156,true,"Tissue atlas Arabidopsis - ProteomicsDB",114,32188942,"MaxQuant score",107.9800000,0.9996460,,,,4.1390301278399E-38,
EVGEQIVCGSMGGEEIESDLESK,ph,S,193,true,"Tissue atlas Arabidopsis - ProteomicsDB",114,32188942,"MaxQuant score",73.9360000,0.9086500,,,,5.4890900713644E-9,
EVGEQIVCGSMGGEEIESDLESKK,ph,S,201,true,"SnRK2 protein kinase substrates",85,23776212,XCorr,3.0781136,0.8600000,,,,0.00060751201817766,
EVGEQIVCGSMGGEEIESDLESK,ph,S,201,true,"Phospho cell culture sucrose/TOR",109,30833711,,,0.9927710,,,,,
EVGEQIVCGSMGGEEIESDLESK,ph,S,201,true,"Tissue atlas Arabidopsis - ProteomicsDB",114,32188942,"MaxQuant score",389.5300000,0.9998740,,,,0,
EVACVAGFTEISSQDK,ph,S,247,true,"Tissue atlas Arabidopsis - ProteomicsDB",114,32188942,"MaxQuant score",128.4800000,0.8289820,,,,9.6664301452165E-8,
GLDESGNGFLDEEPVK,ph,S,255,true,"Tissue atlas Arabidopsis - ProteomicsDB",114,32188942,"MaxQuant score",97.8230000,1.0000000,,,,8.5298097474151E-6,
EGVDVTEDEMDIQVLKK,ph,T,289,true,"Tissue atlas Arabidopsis - ProteomicsDB",114,32188942,"MaxQuant score",296.1300000,1.0000000,,,,0,
EGVDVTEDEMDIQVLK,ph,T,289,true,"Tyrosine phosphorylation in Arabidopsis",59,18463617,"MASCOT Score",22.0000000,,,,,,-2.1592382
EGVDVTEDEMDIQVLK,ph,T,289,true,"Phospho cell culture sucrose/TOR",109,30833711,,,1.0000000,,,,,
DSSVADIEEGR,ph,S,470,true,"Tissue atlas Arabidopsis - ProteomicsDB",114,32188942,"MaxQuant score",150.6200000,0.9963930,,,,8.2676609395164E-44,
IAEVSEETDTR,ph,S,507,true,"Tissue atlas Arabidopsis - ProteomicsDB",114,32188942,"MaxQuant score",132.9900000,0.9999880,,,,3.0554099339497E-6,
IAEVSEETDTR,ph,T,510,true,"Tissue atlas Arabidopsis - ProteomicsDB",114,32188942,"MaxQuant score",109.0700000,0.9646240,,,,0.00020823400700465,
IEDEDQEKDDEMTDVAEDVK,ph,T,526,true,"Tissue atlas Arabidopsis - ProteomicsDB",114,32188942,"MaxQuant score",224.2100000,1.0000000,,,,0,
THGDSSVADIEEGR,ph,S,538,true,"Tissue atlas Arabidopsis - ProteomicsDB",114,32188942,"MaxQuant score",234.2900000,0.9846050,,,,0,
THGDSSVADIEEGR,ph,S,539,true,"Tissue atlas Arabidopsis - ProteomicsDB",114,32188942,"MaxQuant score",242.1900000,0.9960190,,,,0,
DSSVADIEEGR,ph,S,539,true,"Tissue atlas Arabidopsis - ProteomicsDB",114,32188942,"MaxQuant score",150.6200000,0.9963930,,,,8.2676609395164E-44,
THGDSSVADIEEGRESQEEMTETQEDSVMADEEPEEVEEENK,ph,T,554,true,"TOR Kinase and ABA Receptor",100,29290610,XCorr,5.3005705,0.8951000,,,,0.00013129999570083,
TQLSLSPEELDQAK,ph,S,732,true,"Tissue atlas Arabidopsis - ProteomicsDB",114,32188942,"MaxQuant score",134.0800000,0.9993290,,,,2.589940049802E-5,
TQLSLSPEELDQAK,ph,S,734,true,"Tissue atlas Arabidopsis - ProteomicsDB",114,32188942,"MaxQuant score",84.0460000,0.9713010,,,,0.00033713100128807,
QGTASETDYVTDGGSDSDSSPKK,ph,S,759,true,"Conserved plant phosphoproteome - Arabidopsis",61a,20466843,"MASCOT Score",21.0000000,1.0000000,,,,,
QGTASETDYVTDGGSDSDSSPKK,ph,T,761,true,"Tyrosine phosphorylation in Arabidopsis",59,18463617,"MASCOT Score",23.0000000,,,,,,-1.6176123
QGTASETDYVTDGGSDSDSSPKK,ph,Y,763,true,"srk2dei ABA signaling phopshoproteomics",83,23572148,"MASCOT Score",22.0000000,,,,,,-0.0017000
QGTASETDYVTDGGSDSDSSPKK,ph,S,769,true,"srk2dei ABA signaling phopshoproteomics",83,23572148,"MASCOT Score",44.0000000,,,,,,-0.0002000
QGTASETDYVTDGGSDSDSSPKK,ph,S,769,true,"Brassinosteroid-Regulated Phosphorylation Dynamics",94,26187819,"MaxQuant Score",83.1650000,0.9720000,,,,0.0020000000949949,1.8300000
QGTASETDYVTDGGSDSDSSPKK,ph,S,769,true,"Tissue atlas Arabidopsis - ProteomicsDB",114,32188942,"MaxQuant score",173.6400000,0.9991610,,,,1.4012984643248E-45,
QGTASETDYVTDGGSDSDSSPK,ph,S,769,true,"SnRK2 protein kinase substrates",85,23776212,XCorr,3.8587956,0.8870000,,,,0.00053673301590607,
QGTASETDYVTDGGSDSDSSPKK,ph,S,771,true,"srk2dei ABA signaling phopshoproteomics",83,23572148,"MASCOT Score",44.0000000,,,,,,-0.0002000
QGTASETDYVTDGGSDSDSSPKK,ph,S,771,true,"Tissue atlas Arabidopsis - ProteomicsDB",114,32188942,"MaxQuant score",173.6400000,0.8959060,,,,1.4012984643248E-45,
QGTASETDYVTDGGSDSDSSPKK,ph,S,773,true,"Brassinosteroid-Regulated Phosphorylation Dynamics",94,26187819,"MaxQuant Score",83.1650000,0.7540000,,,,0.0020000000949949,1.8300000
SGSAEKILSSGDK,ac,K,791,true,"Histone deacetylases - apicidin vs control",98a,29061669,"MaxQuant Score",129.0000000,1.0000000,0.3610000,0.0744732,NO,1.4000000048142E-9,
SGSAEKILSSGDK,ac,K,791,true,"Histone deacetylases substrates - TSA vs control",98b,29061669,"MaxQuant Score",129.0000000,1.0000000,1.1630000,0.1506607,NO,1.4000000048142E-9,
SGSAEKILSSGDK,ac,K,791,true,"Histone deacetylases substrates - hda14 vs WT",98e,29061669,"MaxQuant Score",134.9000000,1.0000000,0.3040000,0.7161434,NO,2.300000078472E-22,
NLSDETMEWASK,ph,S,801,true,"Tissue atlas Arabidopsis - ProteomicsDB",114,32188942,"MaxQuant score",159.1800000,0.9999990,,,,7.2507200243876E-10,
SQVICDSR,sno,C,856,true,"hot5-4 / wildtype, FAT-switch S-nitrosoproteome",169,37277371,,,,,,,,
MDPDCESEDEDEKEEKEK,ph,S,1156,true,"SnRK2 protein kinase substrates",85,23776212,XCorr,2.1991193,1.0000000,,,,0.014116000384092,
MDPDCESEDEDEKEEK,ph,S,1156,true,"Tyrosine phosphorylation in Arabidopsis",59,18463617,"MASCOT Score",27.0000000,,,,,,-1.2114260
MDPDCESEDEDEKEEK,ph,S,1156,true,"srk2dei ABA signaling phopshoproteomics",83,23572148,"MASCOT Score",65.0000000,,,,,,-0.0002000
MDPDCESEDEDEKEEK,ph,S,1156,true,"SnRK2 protein kinase substrates",85,23776212,XCorr,4.4838324,1.0000000,,,,1.4624399469199E-9,
MDPDCESEDEDEKEEK,ph,S,1156,true,"atm and atr DNA damage response",88,25561503,"MASCOT Score",54.0000000,1.0000000,,,,,0.1000000
MDPDCESEDEDEK,ph,S,1156,true,"TOR Kinase and ABA Receptor",100,29290610,XCorr,5.5103898,1.0000000,,,,1.3449999869408E-7,
RGRDPISPR,ph,S,1187,true,"Tissue atlas Arabidopsis - ProteomicsDB",114,32188942,"MaxQuant score",80.3120000,1.0000000,,,,0.0015230400022119,
GRDPISPR,ph,S,1187,true,"SnRK2 protein kinase substrates",85,23776212,XCorr,2.0494053,1.0000000,,,,0.16692300140858,
GRDPISPR,ph,S,1187,true,"atm and atr DNA damage response",88,25561503,"MASCOT Score",32.0000000,1.0000000,,,,,-0.6700000
EVQPSLGSEKPR,ub,K,1258,true,"Arabidopsis ubiquitination COFRADIC",40,26744219,"MaxQuant Score",111.9400000,1.0000000,,,,0,-0.6110000
SVSIPETPAR,ph,S,1263,true,"Tissue atlas Arabidopsis - ProteomicsDB",114,32188942,"MaxQuant score",58.3700000,0.7510060,,,,0.016647500917315,
SVSIPETPAR,ph,T,1267,true,"TOR Kinase and ABA Receptor",100,29290610,XCorr,2.3093371,1.0000000,,,,0.0064599998295307,
SVSIPETPAR,ph,T,1267,true,"Tissue atlas Arabidopsis - ProteomicsDB",114,32188942,"MaxQuant score",124.1200000,1.0000000,,,,0.00027948498609476,
AIAPPELSPR,ph,S,1281,true,"Arabidopsis root NAA phosphoproteome",18a,27643528,"MaxQuant Score",57.1750000,1.0000000,,,,0.00019560000509955,-0.0690000
AIAPPELSPR,ph,S,1281,true,"STN8 phosphoproteome",38,21768351,"MASCOT Score",58.0100000,,,,,,-0.4695980
AIAPPELSPR,ph,S,1281,true,"Phosphoproteome ethylene-regulated time response",46,24043427,"MASCOT Score",44.2600000,,,,,,-23.4407000
AIAPPELSPR,ph,S,1281,true,"Tyrosine phosphorylation in Arabidopsis",59,18463617,"MASCOT Score",59.0000000,,,,,,-1.1508989
AIAPPELSPR,ph,S,1281,true,"srk2dei ABA signaling phopshoproteomics",83,23572148,"MASCOT Score",54.0000000,,,,,,-0.0005000
AIAPPELSPR,ph,S,1281,true,"LAXIC - ABA stress",84a,23660473,XCorr,2.0100000,1.0000000,,,,0.078861497342587,
AIAPPELSPR,ph,S,1281,true,"SnRK2 protein kinase substrates",85,23776212,XCorr,2.1135037,1.0000000,,,,0.029731599614024,
AIAPPELSPR,ph,S,1281,true,"atm and atr DNA damage response",88,25561503,"MASCOT Score",42.0000000,1.0000000,,,,,0.2300000
AIAPPELSPR,ph,S,1281,true,"Brassinosteroid-Regulated Phosphorylation Dynamics",94,26187819,"MaxQuant Score",132.7900000,1.0000000,,,,0.0010000000474975,-2.5250000
AIAPPELSPR,ph,S,1281,true,"TOR Kinase and ABA Receptor",100,29290610,XCorr,2.6198566,1.0000000,,,,0.002608000067994,
AIAPPELSPR,ph,S,1281,true,"Lateral root-induction - NAA vs control",106,23328941,"MASCOT Score",26.0000000,,,,,,
AIAPPELSPR,ph,S,1281,true,"Phospho cell culture sucrose/TOR",109,30833711,,,1.0000000,,,,,
AIAPPELSPR,ph,S,1281,true,"Col-0 callus - FC Col-0 vs. Col-0 Xray",111a,31410901,,29.4600000,,0.6482285,0.0000000,NO,,0.0204831
AIAPPELSPR,ph,S,1281,true,"Col-0 X-ray callus - FC Col-0 vs. Col-0 Xray",111b,31410901,,29.4600000,,0.6482285,0.0000000,NO,,0.0204831
AIAPPELSPR,ph,S,1281,true,"atm callus - FC atm vs. atm Xray",111c,31410901,,29.4600000,,0.5306949,0.0000000,NO,,0.0204831
AIAPPELSPR,ph,S,1281,true,"atm-3 X-ray callus - FC atm vs. atm Xray",111d,31410901,,29.4600000,,0.5306949,0.0000000,NO,,0.0204831
AIAPPELSPR,ph,S,1281,true,"Tissue atlas Arabidopsis - ProteomicsDB",114,32188942,"MaxQuant score",145.2800000,1.0000000,,,,6.792189992666E-7,
AIAPPELSPR,ph,S,1281,true,"Touch-induced phosphorylation: 40s touch vs untouc",136,30291188,"MASCOT score",45.1000000,,-0.0140763,0.9127507,NO,,-0.2432123
NSQDTWSQGGSLPSPTPNQITTPTAK,ph,S,1423,true,"LAXIC - ABA stress",84a,23660473,XCorr,4.1100000,0.7740000,,,,0.035147599875927,
NSQDTWSQGGSLPSPTPNQITTPTAK,ph,S,1423,true,"Lateral root-induction - NAA vs control",106,23328941,"MASCOT Score",37.0000000,,,,,,
NSQDTWSQGGSLPSPTPNQITTPTAK,ph,S,1423,true,"Phospho cell culture sucrose/TOR",109,30833711,,,0.9759020,,,,,
NSQDTWSQGGSLPSPTPNQITTPTAK,ph,S,1423,true,"Col-0 callus - FC Col-0 vs. Col-0 Xray",111a,31410901,,29.6300000,,1.8688733,0.0236316,YES,,2.1025147
NSQDTWSQGGSLPSPTPNQITTPTAK,ph,S,1423,true,"Col-0 X-ray callus - FC Col-0 vs. Col-0 Xray",111b,31410901,,29.6300000,,1.8688733,0.0236316,YES,,2.1025147
NSQDTWSQGGSLPSPTPNQITTPTAK,ph,S,1423,true,"atm callus - FC atm vs. atm Xray",111c,31410901,,29.6300000,,1.1950936,0.1471247,NO,,2.1025147
NSQDTWSQGGSLPSPTPNQITTPTAK,ph,S,1423,true,"atm-3 X-ray callus - FC atm vs. atm Xray",111d,31410901,,29.6300000,,1.1950936,0.1471247,NO,,2.1025147
NSQDTWSQGGSLPSPTPNQITTPTAK,ph,S,1423,true,"Tissue atlas Arabidopsis - ProteomicsDB",114,32188942,"MaxQuant score",91.4180000,0.8409330,,,,5.6236100261033E-16,
NSQDTWSQGGSLPSPTPNQITTPTAK,ph,T,1425,true,"LAXIC - ABA stress",84a,23660473,XCorr,4.1100000,0.7740000,,,,0.035147599875927,
NSQDTWSQGGSLPSPTPNQITTPTAK,ph,T,1425,true,"TOR Kinase and ABA Receptor",100,29290610,XCorr,3.4020391,0.8080000,,,,0.003175999969244,
NSQDTWSQGGSLPSPTPNQITTPTAK,ph,T,1425,true,"Lateral root-induction - NAA vs control",106,23328941,"MASCOT Score",40.0000000,,,,,,
NSQDTWSQGGSLPSPTPNQITTPTAK,ph,T,1430,true,"Lateral root-induction - NAA vs control",106,23328941,"MASCOT Score",33.0000000,,,,,,
NSQDTWSQGGSLPSPTPNQITTPTAK,ph,T,1431,true,"Lateral root-induction - NAA vs control",106,23328941,"MASCOT Score",37.0000000,,,,,,
NSQDTWSQGGSLPSPTPNQITTPTAK,ph,T,1431,true,"Phospho cell culture sucrose/TOR",109,30833711,,,0.8330120,,,,,
WSPTKPSPQSANQSMNYSVAQSGQSQTSR,ph,S,1444,true,"Phospho cell culture sucrose/TOR",109,30833711,,,0.9876930,,,,,
WSPTKPSPQSANQSMNYSVAQSGQSQTSR,ph,S,1444,true,"Tissue atlas Arabidopsis - ProteomicsDB",114,32188942,"MaxQuant score",389.4700000,0.9996680,,,,0,
WSPTKPSPQSANQSMNYSVAQSGQSQTSR,ph,T,1446,true,"Lateral root-induction - NAA vs control",106,23328941,"MASCOT Score",25.0000000,,,,,,
WSPTKPSPQSANQSMNYSVAQSGQSQTSR,ph,S,1449,true,"Tissue atlas Arabidopsis - ProteomicsDB",114,32188942,"MaxQuant score",234.5000000,0.9882200,,,,0,
QSGGQQNNFKGQR,ub,K,1748,true,"Arabidopsis ubiquitination COFRADIC",40,26744219,"MaxQuant Score",113.4200000,1.0000000,,,,1.2310000126181E-14,0.0050000
